program: Gaussian 09
title: 000146858
version: EM64L-G09RevD.01
frameworkgroup: C1[X(C5H6O5)]
method: RPBEPBE
basis: SDD
operation: Freq
keyword: #p
keyword: freq=noraman
keyword: PBEPBE/SDD
title: #p freq=noraman PBEPBE/SDD
converged: YES YES NO NO
title: Mulliken charges:
elementType: O O O O O C C C C C H H H H H H
charge: -0.278476 -0.424019 -0.214219 -0.408472 -0.228396 0.334787 -0.406974 -0.567750 0.173098 0.194938 0.226308 0.259769 0.272818 0.292326 0.391675 0.382586
chargesum: 0.00000
title: Mulliken charges with hydrogens summed into heavy atoms:
elementType: O O O O O C C C C C
charge: -0.278476 -0.032343 -0.214219 -0.025886 -0.228396 0.334787 0.079103 -0.002606 0.173098 0.194938
polarizability: 7.27824222e+01 2.74582825e+00 6.67084365e+01 -7.81884199e+00 -7.64066661e-01 5.90829342e+01
1716.lowfreq: -7.4894 -0.0008 -0.0003 0.0009 4.2582 7.9802 34.6231 55.9891 71.1265
frequency: 34.5257 55.9109 71.1259 120.7102 235.4293 265.0380 325.1209 338.1135 371.9910 441.7821 500.0038 549.3488 586.4024 608.1585 640.3227 687.7509 720.4818 776.4763 824.9788 880.9835 914.7555 959.6741 1036.3651 1054.2664 1067.2152 1129.5251 1152.5095 1215.9380 1258.2040 1327.7514 1357.8631 1370.3522 1433.6751 1466.1752 1665.8745 1668.1291 3027.0854 3078.6056 3087.3843 3195.7987 3517.3638 3528.7684
redmass: 10.9575 5.7581 8.1069 6.1997 5.4351 3.9596 3.5025 4.8689 6.2408 3.7377 2.0368 3.8746 2.6300 1.7599 1.3971 4.3293 4.4013 8.0905 4.7042 4.1603 1.3679 2.5940 2.8097 1.6504 1.7457 1.3228 1.3811 1.5101 1.6448 2.8747 2.5932 3.2353 1.1304 1.1980 8.5114 9.4010 1.0618 1.0540 1.0988 1.1193 1.0640 1.0643
irintensity: 0.9275 0.6471 2.0410 4.3998 0.8960 6.0447 3.4360 4.6062 2.9093 11.2985 33.2602 53.2413 65.9049 81.3481 113.9896 53.1939 36.1245 11.6852 19.5720 5.9018 14.7026 35.6130 214.2624 95.2486 181.6466 59.0428 6.2434 6.2251 3.4670 12.5818 100.6191 31.8636 49.3225 3.0997 150.9318 237.1983 4.1569 17.4013 0.5783 6.5799 28.3559 39.4412
temp: 298.150 k
press: 1.00000 atm
elementType: 8 8 8 8 8 6 6 6 6 6 1 1 1 1 1 1
symmnumber: 1
zpe: 290381.1 jmol-1
zpe.correction: 0.110600 hartree
zpe.thermalcorrener: 0.120570 hartree
zpe.thermalcorrenthalpy: 0.121514 hartree
zpe.thermalcorrgfe: 0.073930 hartree
zpe.sumelectzpe: -569.447796 hartree
zpe.sumelectthermal: -569.437827 hartree
zpe.sumelectthermalent: -569.436882 hartree
zpe.sumelectthermalfe: -569.484467 hartree
dipole: 2.9298 0.3793 -0.3826
dipole: 2.9790
quadrupole: -58.6500 -49.7197 -61.3505
quadrupole: -1.4891 0.7237 -6.4609
quadrupole: -2.0766 6.8537 -4.7771 -1.4891 0.7237 -6.4609
hfenergy: -569.5583964 hartree
pointgroup: C01 [X(C5H6O5)]
dipole: -1.1132425 -0.102149 -0.3519431 debye
dipolederiv: -0.505914 -0.079311 0.0618816 -0.079408 -0.4204779 0.0569207 0.0747417 0.1652883 -0.3199082 -0.4658677 -0.162719 -0.161588 -0.2506133 -0.5850587 -0.4394537 -0.2250054 -0.3629854 -0.8998118 -0.7208003 0.1636921 -0.2826622 0.2962685 -0.5920213 0.0440594 -0.2042935 -0.0804813 -0.5679518 -1.1432422 0.1584573 -0.4595595 0.0899347 -0.3509344 -0.0465144 -0.3747606 -0.012959 -0.5376701 -0.662868 -0.0952361 -0.0163131 0.0770236 -0.5657852 0.3370805 -0.2021583 0.2758331 -0.6862803 0.4489039 0.0589893 0.0488697 0.0287978 -0.022508 -0.1130309 -0.0002384 -0.1994766 0.1012086 0.1856824 0.0058709 -0.0698556 -0.0447148 0.1904008 -0.0481187 -0.0454082 0.0357265 0.2505149 -0.1686175 -0.0839879 0.0326628 -0.1599349 -0.1331872 0.1087109 0.0970142 0.1288435 -0.0357641 0.8137679 -0.2381683 0.4433173 -0.2232433 1.083763 0.4815238 0.4562656 0.4355605 1.0305654 1.5184408 0.0991416 0.3587325 0.0745013 0.662087 -0.4851774 0.4095183 -0.4752959 0.8890583 0.0026781 0.0809766 0.0832074 0.1061126 0.0204094 -0.0319465 0.0516959 -0.030326 0.016932 0.0413542 0.0442463 -0.0508475 0.0390651 0.1071396 0.0647894 -0.0254888 0.0264155 -0.0006009 0.0327944 0.0317867 0.0108825 0.0571161 -0.0142966 -0.0109875 0.0049463 -0.0520163 0.1285491 0.0802857 -0.0411312 -0.0025506 -0.0278077 0.1346988 -0.0390389 -0.0154519 -0.0259243 -0.0004402 0.250527 0.1315557 -0.0413642 0.1200503 0.2330502 0.006967 -0.0762523 0.0459696 0.3592924 0.2928753 -0.0741631 0.0451868 -0.103148 0.2527206 0.1142161 0.0748754 0.1258279 0.2723068 unknown
polarizability: 70.2464073|-0.4228465|65.3432868|9.6416319|3.0842843|62.984099 unknown
InChI: InChI=1S/C5H6O5/c6-3(7)1-5(2-10-5)4(8)9/h6,8H,1-2H2
charge 0 multiplicity 1
16 atoms
O  1.618588 1.798404 0.054099
O  0.843824 -1.39112 -1.243544
O  2.343361 -1.129013 0.515244
O  -2.949935 0.183746 -0.789598
O  -1.672125 -0.822713 0.869053
C  0.666272 0.614641 0.068526
C  0.994124 1.332128 1.342813
C  -0.650634 0.851615 -0.646448
C  1.382546 -0.700153 -0.154168
C  -1.7584 -0.023413 -0.087481
H  0.242458 2.009634 1.765446
H  1.69316 0.860367 2.041166
H  -0.942861 1.912382 -0.542738
H  -0.556005 0.651054 -1.72737
H  1.321395 -2.256186 -1.358824
H  -3.662968 -0.397771 -0.408876
