program: Gaussian 09
title: 000146842
version: EM64L-G09RevD.01
frameworkgroup: C1[X(C5H13N3O)]
method: RPBEPBE
basis: SDD
operation: Freq
keyword: #p
keyword: freq=noraman
keyword: PBEPBE/SDD
title: #p freq=noraman PBEPBE/SDD
converged: YES YES NO NO
title: Mulliken charges:
elementType: O N N N C C C C C H H H H H H H H H H H H H
charge: -0.288218 -0.082250 -0.044156 0.042236 -0.326650 -0.383535 -0.615419 -0.612688 -0.634193 0.202524 0.215497 0.232222 0.251520 0.229152 0.194389 0.224797 0.225625 0.193788 0.225342 0.228112 0.254650 0.267255
chargesum: 0.00000
title: Mulliken charges with hydrogens summed into heavy atoms:
elementType: O N N N C C C C C
charge: -0.288218 -0.082250 -0.044156 0.042236 0.091371 0.100207 0.032919 0.032067 0.115824
polarizability: 1.07051772e+02 -3.98015614e+00 7.72637900e+01 -7.20606848e+00 1.94228706e+00 6.32446633e+01
1716.lowfreq: -6.2286 -0.0004 -0.0004 0.0002 7.7606 22.4775 36.8539 54.4134 57.3562
frequency: 36.5795 54.3021 57.2891 94.2910 126.5499 204.7578 223.2197 245.6178 280.3799 326.2653 349.1864 364.2544 395.7957 430.1609 454.6522 692.1055 788.3256 811.3286 835.6009 976.3230 1020.6045 1033.5893 1037.5891 1060.1633 1091.5694 1097.3774 1119.0334 1145.9539 1221.2567 1260.9940 1274.2245 1282.2813 1305.6552 1315.5796 1347.1836 1377.1150 1418.8553 1422.0001 1442.9934 1445.7653 1455.9750 1463.6816 1469.8557 1476.7278 1482.1308 1484.2503 1487.2919 2856.7338 2861.4330 2875.5642 2988.7434 3009.8219 3019.6891 3021.7844 3033.5933 3071.1839 3079.1002 3085.2083 3091.3523 3123.6720
redmass: 2.7397 2.4533 1.4442 3.0484 2.0797 2.3045 1.1727 1.2901 3.4372 3.3576 2.4739 2.7044 4.7818 2.7472 2.6318 4.4894 1.2648 4.7022 3.9449 2.8582 2.6475 1.4933 1.7028 2.5508 1.2837 1.3749 1.4884 1.6929 2.4719 2.3552 2.1275 2.9945 1.5218 1.6200 2.2873 1.3586 1.1717 1.1428 1.1076 1.0958 1.0826 1.0537 1.0597 1.0539 1.0786 1.0666 1.0572 1.0623 1.0608 1.0590 1.0350 1.0605 1.0879 1.0739 1.0737 1.0978 1.1014 1.1017 1.1008 1.1018
irintensity: 3.9694 3.0010 1.5832 0.5040 1.2984 1.7230 0.4031 0.4319 2.5478 3.4067 7.9279 8.5975 3.8258 6.9655 2.7887 8.2384 3.6593 12.0150 16.8128 123.9980 39.2770 14.7648 7.5280 15.5549 4.4960 12.4890 34.8261 8.3047 10.7941 5.8325 28.1446 9.2004 77.0268 20.1573 32.6200 9.1316 32.4793 0.8385 7.2167 14.0371 3.8143 16.8935 4.0418 8.5136 22.7159 24.2117 17.8616 59.0350 58.4816 199.2049 14.7618 24.5780 23.0381 47.3297 43.0205 16.7264 20.4490 47.6512 23.0182 9.4081
temp: 298.150 k
press: 1.00000 atm
elementType: 8 7 7 7 6 6 6 6 6 1 1 1 1 1 1 1 1 1 1 1 1 1
symmnumber: 1
zpe: 489898.1 jmol-1
zpe.correction: 0.186592 hartree
zpe.thermalcorrener: 0.198092 hartree
zpe.thermalcorrenthalpy: 0.199036 hartree
zpe.thermalcorrgfe: 0.148229 hartree
zpe.sumelectzpe: -436.963554 hartree
zpe.sumelectthermal: -436.952055 hartree
zpe.sumelectthermalent: -436.951110 hartree
zpe.sumelectthermalfe: -437.001918 hartree
dipole: -4.0262 2.3867 0.8121
dipole: 4.7504
quadrupole: -67.3865 -54.2384 -56.8698
quadrupole: 8.3080 6.5671 -1.5756
quadrupole: -7.8883 5.2598 2.6284 8.3080 6.5671 -1.5756
hfenergy: -437.1501467 hartree
pointgroup: C01 [X(C5H13N3O1)]
dipole: 1.5558214 -0.5050765 -0.9040214 debye
dipolederiv: -1.1461004 0.3978313 0.3732657 0.2162819 -0.3200883 -0.1296529 -0.309391 0.0944787 -0.2019818 -0.7107204 -0.0552824 0.0407418 -0.002914 -0.5700234 -0.0114734 0.0368306 -0.0082452 -0.5100869 -0.634381 0.1324129 0.1298582 0.3151677 -0.3716835 -0.0985573 0.4939364 -0.1385468 -0.3115854 1.0868567 -0.6026216 -0.5326181 -0.6356418 0.2208278 0.2949446 -0.3770864 0.1944671 0.125244 0.5614286 -0.0709735 0.028425 -0.0251433 0.3464936 0.0641065 0.0108929 0.0873262 0.1034847 0.435074 -0.0362855 0.0440481 -0.0441299 0.2372844 -0.0275995 0.1492539 -0.0916779 0.0984168 0.0994742 0.0290926 0.1128357 0.0586873 0.3847721 0.0901032 0.1591272 0.0988859 0.3353463 0.2470172 0.0745541 -0.1729775 0.0853861 0.3833134 -0.0722294 -0.2598008 -0.0776419 0.2732334 0.0724186 0.0323338 0.0015242 0.0173827 0.1884459 -0.0362257 0.0663616 -0.0667698 0.1374137 -0.0892515 0.010316 0.0009838 0.1087451 -0.2283747 0.0008453 0.0492454 -0.0590271 0.045265 0.0427205 -0.0012488 -0.0414379 0.0043585 0.0538131 -0.0425633 -0.0784313 -0.0174745 -0.1518547 -0.0048252 0.0421259 -0.001076 0.0330628 -0.1246833 -0.0044663 -0.0067752 -0.0396111 0.0942831 0.0832358 0.0008649 -0.0077559 -0.030059 0.0905039 -0.0499477 -0.0598693 -0.0000033 -0.0766533 0.0462674 -0.0747707 0.1458471 -0.0768633 0.0309345 0.054493 0.105136 0.0520636 -0.0694685 0.0612256 0.0262814 -0.0276796 -0.0730674 -0.2608234 -0.1601572 -0.0491256 -0.0002989 -0.0265649 -0.1692887 0.0700312 -0.0860681 0.0734099 0.0610118 -0.0088835 -0.0124673 -0.0114788 0.0893917 -0.1820814 0.0667918 0.0127694 0.0774811 0.0503388 0.0341802 -0.0612248 0.0375275 0.0914994 0.0143464 0.0032897 0.0618705 -0.1510005 -0.2798468 0.1262432 0.0724559 -0.0101336 0.0073125 0.0868959 -0.0495512 -0.1031531 -0.0483336 0.0527293 -0.0665753 -0.0253799 -0.0613269 -0.1430569 0.0479959 0.1214038 0.0561966 0.1077068 0.0188458 -0.0576175 0.0313996 -0.0416554 0.0553076 0.0978863 -0.0106171 -0.0142702 0.0142117 -0.0449151 0.1106628 0.002749 0.0310176 -0.0375678 -0.0461947 -0.1059786 -0.0213297 -0.0247289 0.081124 -0.00963 0.0621632 0.0281248 0.072622 unknown
polarizability: 107.1820568|-6.5042223|64.7203098|-3.7335058|5.4513446|75.6578585 unknown
InChI: InChI=1S/C5H13N3O/c1-7(2)4-5-8(3)6-9/h4-5H2,1-3H3
charge 0 multiplicity 1
22 atoms
O  -3.543758 0.496253 0.778596
N  2.188589 -0.312654 0.048072
N  -1.60798 -0.501062 0.244843
N  -2.339554 0.233237 1.160839
C  0.789503 0.085315 -0.215948
C  -0.20795 -0.766378 0.609988
C  2.661394 0.073576 1.394953
C  3.113307 0.146064 -1.010416
C  -2.196498 -0.93657 -1.034758
H  0.599975 1.1690 -0.005142
H  0.589912 -0.077148 -1.292579
H  0.029876 -1.835282 0.455749
H  -0.127486 -0.53914 1.686161
H  2.037934 -0.393873 2.175991
H  2.652829 1.180653 1.560411
H  3.695452 -0.286912 1.536273
H  4.124009 -0.25505 -0.815891
H  3.193703 1.260151 -1.081054
H  2.778524 -0.236625 -1.991057
H  -1.54677 -1.70446 -1.482247
H  -2.311295 -0.087813 -1.734614
H  -3.204417 -1.346282 -0.848669
