program: Gaussian 09
title: 000146849
version: EM64L-G09RevD.01
frameworkgroup: C1[X(C12H17NO4)]
method: RPBEPBE
basis: SDD
operation: Freq
keyword: #p
keyword: freq=noraman
keyword: PBEPBE/SDD
title: #p freq=noraman PBEPBE/SDD
converged: YES YES NO NO
title: Mulliken charges:
elementType: O O O O N C C C C C C C C C C C C H H H H H H H H H H H H H H H H H
charge: -0.265563 -0.213804 -0.305234 -0.274828 -0.310634 0.454960 -0.257057 -0.394192 0.350476 -0.329719 -0.413099 -0.374348 -0.350822 -0.437627 -0.678285 0.332460 -0.496379 0.201221 0.202545 0.219767 0.219183 0.257903 0.227786 0.251041 0.246387 0.207534 0.238100 0.210075 0.228097 0.209705 0.330261 0.237875 0.244981 0.231234
chargesum: 0.00000
title: Mulliken charges with hydrogens summed into heavy atoms:
elementType: O O O O N C C C C C C C C C C C C
charge: -0.265563 -0.213804 -0.305234 -0.274828 0.019627 0.454960 0.146709 0.044758 0.350476 -0.071816 -0.185313 -0.123307 -0.104435 0.008006 -0.030408 0.332460 0.217712
polarizability: 2.56581525e+02 1.19830065e+00 1.39258860e+02 3.85406906e+00 3.47171064e-01 9.15400965e+01
1716.lowfreq: -14.8702 -5.5211 0.0005 0.0009 0.0010 3.0882 8.2515 21.1969 38.3296
frequency: 6.2194 21.0715 38.2076 49.4678 59.5060 71.1337 79.5860 93.4627 101.4496 138.7178 144.0228 186.1653 222.2326 227.9199 243.9362 269.2951 297.7211 332.7482 347.4836 380.0354 415.4091 465.1291 469.4515 494.0587 520.7695 589.0941 632.4545 654.5573 691.2625 720.5356 767.3272 768.2189 808.5866 828.3740 833.1037 873.0364 893.7375 895.9142 902.9671 942.1142 957.2505 970.8573 979.6905 984.6836 1004.4933 1053.7162 1059.2284 1117.4443 1119.4685 1136.2826 1142.1715 1143.4660 1167.1183 1177.9702 1188.5881 1224.1026 1230.5813 1237.3351 1285.3678 1307.0955 1310.3522 1342.3209 1375.0608 1389.1221 1397.2748 1399.0501 1421.4112 1435.0941 1451.7264 1470.5260 1471.8745 1478.5229 1479.1970 1481.3610 1489.4366 1506.3402 1583.5654 1624.6999 1667.6703 2945.1544 2978.3824 2999.6718 3001.3493 3003.4654 3005.0932 3052.7683 3070.4617 3081.1323 3083.8518 3101.7578 3124.9624 3139.0088 3144.0257 3165.7873 3169.1702 3547.6876
redmass: 4.8486 4.4107 2.6825 2.7301 1.8447 3.7864 2.6158 2.7204 3.3934 3.0213 3.2558 5.2374 2.5657 1.4555 3.5036 4.4398 5.4075 4.3355 2.9945 5.9047 2.9801 1.2701 4.2121 5.2662 2.8145 5.0694 6.7242 6.2466 8.7088 3.6956 1.4559 2.3775 1.6331 2.5198 2.2319 3.2393 2.9874 1.4704 1.7321 1.4216 5.9960 1.3941 3.1522 2.1979 2.6530 2.7783 8.9770 1.2542 1.3088 2.1622 1.4483 1.5162 1.1361 1.2645 2.1799 2.3441 1.2652 3.4060 1.1025 1.2961 1.3565 1.3196 1.7870 2.5855 1.2870 1.4130 3.6624 1.2960 1.0507 1.0569 1.0813 1.0951 1.1034 1.0432 1.1128 2.4521 7.0070 6.4216 9.4138 1.0550 1.0362 1.0567 1.0304 1.1064 1.0601 1.1014 1.1090 1.1030 1.0988 1.1047 1.0896 1.0896 1.1043 1.0939 1.0958 1.0790
irintensity: 0.8031 0.5136 1.1658 0.7223 2.3941 2.3086 2.9205 0.7989 3.0317 9.0950 0.3207 4.8849 3.2011 0.2949 4.0641 2.7777 24.1202 8.6617 0.7124 0.8551 0.4784 149.3001 2.8537 2.1795 21.9057 33.4130 0.2256 17.6436 15.4832 3.1859 9.8019 6.3533 67.3490 53.8055 22.1656 15.8311 5.0461 5.7529 7.7363 0.2705 8.2262 2.2730 73.1709 37.1955 4.3968 10.4988 176.4425 1.8562 12.1288 10.0594 0.2893 132.8272 32.5987 165.8631 196.0352 149.1794 0.3014 112.3156 0.0108 2.6154 0.7465 50.5657 1.5078 2.7712 10.3595 132.1474 5.4694 104.4993 13.1233 11.5806 16.2182 4.4702 3.3610 13.8693 41.4239 70.7205 16.3417 119.6913 197.7926 36.1871 39.2251 39.4674 48.1903 29.3443 23.7118 0.0233 14.1566 83.2943 43.7560 30.3978 15.8540 6.2041 19.1216 16.4148 4.7469 36.9752
temp: 298.150 k
press: 1.00000 atm
elementType: 8 8 8 8 7 6 6 6 6 6 6 6 6 6 6 6 6 1 1 1 1 1 1 1 1 1 1 1 1 1 1 1 1 1
symmnumber: 1
zpe: 719863.2 jmol-1
zpe.correction: 0.274181 hartree
zpe.thermalcorrener: 0.292956 hartree
zpe.thermalcorrenthalpy: 0.293901 hartree
zpe.thermalcorrgfe: 0.222689 hartree
zpe.sumelectzpe: -821.755458 hartree
zpe.sumelectthermal: -821.736683 hartree
zpe.sumelectthermalent: -821.735739 hartree
zpe.sumelectthermalfe: -821.806951 hartree
dipole: 0.9123 2.7604 -0.3275
dipole: 2.9256
quadrupole: -67.2657 -96.6441 -102.9686
quadrupole: 2.1066 0.4179 -1.0222
quadrupole: 21.6938 -7.6846 -14.0091 2.1066 0.4179 -1.0222
hfenergy: -822.0296396 hartree
pointgroup: C01 [X(C12H17N1O4)]
dipole: 0.3628422 -0.3079227 -1.0480281 debye
polarizability: 255.470341|13.4528343|94.1039125|-4.1213088|8.1361293|137.8062283 unknown
InChI: InChI=1S/C12H17NO4/c1-3-8-16-11-6-4-10(5-7-11)9-17-13-12(14)15-2/h4-7,13H,3,8-9H2,1-2H3
charge 0 multiplicity 1
34 atoms
O  3.686758 0.576613 0.722739
O  -2.429595 0.486124 -0.861281
O  -5.968165 0.26244 -0.264966
O  -4.219953 -0.187728 1.264977
N  -3.839206 0.23472 -1.026209
C  -0.267974 -0.48254 -0.375005
C  4.790259 0.529196 -0.255627
C  6.057328 0.983322 0.472804
C  2.40507 0.213761 0.288591
C  0.06437 -0.050983 0.938975
C  0.759407 -0.553223 -1.343864
C  1.383906 0.295032 1.271411
C  2.093628 -0.213597 -1.027085
C  -1.688716 -0.834487 -0.713643
C  7.284598 0.979375 -0.464896
C  -4.619352 0.094732 0.11008
C  -6.941408 0.003456 0.817081
H  4.903096 -0.506276 -0.640672
H  4.560169 1.201914 -1.108585
H  5.889311 1.997393 0.880523
H  6.231652 0.314685 1.336129
H  -0.726753 0.019267 1.694172
H  0.518718 -0.876705 -2.363998
H  1.652205 0.629629 2.277989
H  2.866282 -0.282989 -1.797965
H  -1.775937 -1.387012 -1.667538
H  -2.18817 -1.391055 0.098853
H  7.137582 1.660428 -1.324229
H  8.189208 1.310832 0.074515
H  7.484068 -0.032627 -0.864816
H  -4.228631 0.623905 -1.887546
H  -6.882336 -1.048124 1.14651
H  -6.745301 0.664484 1.677864
H  -7.921622 0.219339 0.368611
