program: Gaussian 09
title: 000146832
version: EM64L-G09RevD.01
frameworkgroup: C1[X(C8H9N5O3)]
method: RPBEPBE
basis: SDD
operation: Freq
keyword: #pfreq=noraman
keyword: PBEPBE/SDD
title: #p freq=noraman PBEPBE/SDD
converged: YES YES NO NO
title: Mulliken charges:
elementType: O O O N N N N N C C C C C C C C H H H H H H H H H
charge: -0.466602 -0.392467 -0.235680 -0.174063 -0.091216 -0.047760 -0.064465 -0.611024 -0.390248 -0.111285 0.136812 -0.087623 -0.189764 0.162354 0.143750 -0.364573 0.287216 0.242547 0.266730 0.295502 0.376786 0.241938 0.331526 0.343771 0.397836
chargesum: 0.00000
title: Mulliken charges with hydrogens summed into heavy atoms:
elementType: O O O N N N N N C C C C C C C C
charge: -0.089816 0.005370 -0.235680 -0.174063 -0.091216 -0.047760 -0.064465 0.064273 0.139514 0.155446 0.136812 -0.087623 0.105739 0.162354 0.143750 -0.122635
polarizability: 1.87086419e+02 -4.33952917e+00 1.39689933e+02 1.38747386e+01 -2.09693534e-01 6.42817541e+01
1716.lowfreq: -5.1043 -0.0006 0.0001 0.0003 3.3725 7.2164 22.2848 42.2040 43.8304
frequency: 22.0807 42.1977 43.8172 64.8668 147.9955 171.3815 189.8677 201.6661 259.2754 281.1159 286.3426 334.3564 339.9559 403.1115 472.3095 509.6228 511.0900 543.3090 547.7473 549.1627 574.7499 575.7216 619.9830 646.5198 664.6422 673.2511 701.0016 750.8614 795.8656 836.4547 846.6927 862.3901 912.6673 927.4925 959.7434 1019.0188 1034.1734 1046.4507 1085.4709 1142.0670 1183.2962 1218.1804 1222.1978 1253.0034 1282.3084 1290.2427 1299.4234 1315.3058 1338.5503 1362.6805 1371.6735 1380.8450 1388.1764 1435.4613 1454.0764 1475.1581 1545.9545 1578.3721 1631.6697 1641.5672 3002.1697 3016.0202 3086.7323 3165.1532 3255.5115 3466.6785 3519.3086 3540.9095 3696.3654
redmass: 6.5725 7.0477 9.4025 6.4625 5.5983 6.1463 5.0932 5.5197 4.0320 4.0445 3.6313 2.0396 2.5631 2.6455 4.3414 8.6670 1.2336 3.7669 1.2612 2.0275 3.4731 2.6931 2.3054 4.8390 6.9152 3.8414 6.5473 5.8482 7.0017 1.5231 6.6862 4.3375 2.9079 1.4276 2.4246 3.8378 3.9192 2.9453 2.6038 3.2787 1.7948 1.3791 1.8725 1.8681 1.7783 1.8985 5.3786 4.8122 1.5652 1.6124 1.7117 4.4588 1.6240 2.9245 1.4699 2.2469 7.2672 1.8984 2.7620 9.0927 1.0797 1.0631 1.1049 1.0920 1.0991 1.0652 1.0644 1.0442 1.1056
irintensity: 0.9158 2.5019 4.7407 3.6279 4.2232 3.7014 3.4282 3.3155 19.3869 4.1110 24.2000 43.1135 53.3998 26.6051 17.5566 4.7854 272.0645 6.2808 0.3079 8.7047 36.4204 19.9842 92.1520 51.9145 7.4856 48.9657 11.9992 14.8016 12.1277 15.7018 0.7761 28.1938 16.0594 12.4342 6.8822 201.9946 57.0951 57.6607 41.7296 3.6731 17.3307 22.4100 88.2717 9.9316 89.7146 52.6896 53.5700 40.9638 60.4746 31.4339 2.3969 18.4056 25.3052 53.0460 24.8567 33.0154 58.6137 37.2193 636.3818 198.1519 9.6187 33.0879 3.7602 18.1296 5.4558 54.8391 43.1401 119.7543 49.1687
temp: 298.150 k
press: 1.00000 atm
elementType: 8 8 8 7 7 7 7 7 6 6 6 6 6 6 6 6 1 1 1 1 1 1 1 1 1
symmnumber: 1
zpe: 478586.9 jmol-1
zpe.correction: 0.182284 hartree
zpe.thermalcorrener: 0.196407 hartree
zpe.thermalcorrenthalpy: 0.197351 hartree
zpe.thermalcorrgfe: 0.139437 hartree
zpe.sumelectzpe: -808.526206 hartree
zpe.sumelectthermal: -808.512083 hartree
zpe.sumelectthermalent: -808.511139 hartree
zpe.sumelectthermalfe: -808.569053 hartree
dipole: 2.2744 0.5437 0.2736
dipole: 2.3544
quadrupole: -77.1374 -94.2925 -92.1029
quadrupole: 15.0642 2.8246 -0.7487
quadrupole: 10.7069 -6.4482 -4.2586 15.0642 2.8246 -0.7487
hfenergy: -808.70849 hartree
pointgroup: C01 [X(C8H9N5O3)]
dipole: -0.8999315 -0.1818964 0.1227111 debye
dipolederiv: -0.4363193 0.0769932 -0.0708628 0.2020698 -0.6671112 0.0687803 -0.1431446 0.0592432 -0.549848 -0.3032556 -0.0660922 -0.0125856 -0.1001198 -1.1879546 0.0771541 -0.0061466 0.0918645 -0.3925028 -1.0369911 0.285256 -0.0095769 0.0342377 -0.7118629 0.0457523 0.124358 0.0221647 -0.3041209 -0.8955746 0.0859052 0.0250661 -0.271118 -0.3996891 0.0678672 0.079697 0.0273916 -0.1713659 -0.684606 -0.0290786 0.0293284 -0.015124 -0.3866584 0.0235187 0.0696102 0.0189632 -0.2677172 -0.8236372 0.116673 0.0747451 0.2314403 -0.6389838 0.0490274 0.0661326 0.0475424 -0.2146664 -0.7424306 -0.0323207 0.0755594 -0.5502025 -0.7280602 0.1588123 0.1624302 0.0732345 -0.2804124 -1.2576465 -0.4796587 0.1487061 -0.7203082 -0.4773293 0.0860025 0.1987046 0.0518351 -0.7234178 0.8310914 0.0801693 -0.0502838 0.1851249 0.0375653 0.03362 -0.0362149 0.1207802 0.2239874 -0.1940665 -0.259978 0.0824876 -0.2371366 0.4917711 -0.0167139 0.1209578 -0.0182669 0.3279865 0.7774198 -0.2912907 -0.0331103 -0.3162073 0.3836038 -0.0342859 -0.0825069 -0.0008523 0.10364 -0.6680429 -0.2424644 0.1281389 -0.1439047 0.0909023 -0.0029153 0.145575 0.0356123 -0.0093246 0.4245411 0.1889031 -0.0700446 0.5858799 0.3257583 -0.1088421 -0.1063443 -0.1141109 -0.011387 1.5969306 0.507715 -0.2874374 0.7465241 0.7300848 -0.1946453 -0.3407658 -0.1596489 0.2909513 1.3596377 -0.1769335 -0.0430499 0.1049078 1.3823018 -0.1088709 -0.2614774 -0.1274427 0.194993 0.9094735 -0.0444853 -0.1478785 0.1066232 0.537417 -0.1098443 -0.1806083 -0.0793659 -0.0332012 0.1235902 0.0269822 -0.0201154 -0.0729373 0.02042 0.0285231 0.0008489 0.0044445 0.1032755 -0.0857811 0.011382 0.0492394 0.0388977 0.0665407 -0.0976409 0.0502328 -0.0488488 -0.043399 0.0718339 0.0417809 0.0427155 0.0201517 -0.0268799 -0.0367983 0.0339185 -0.0684407 -0.029601 0.1134889 0.0430928 0.0202062 0.0300666 0.1041858 0.0092406 0.0148796 0.0150518 0.1688139 0.2077035 0.0901845 -0.0022193 -0.038655 0.4007884 -0.0097492 0.0242458 -0.0316183 0.3493453 0.0808944 0.0200988 0.0043102 0.0244882 -0.0915492 0.0283918 0.004679 0.0278184 0.1223881 0.2855228 0.0227133 0.0149671 -0.0023366 0.1719983 0.0294795 0.017293 0.0258637 0.3740144 0.2293063 0.0452889 0.0219447 0.1111046 0.2216853 0.0055757 0.0111474 0.015249 0.3757429 0.1169172 -0.0208361 0.0297499 0.0465333 0.3510557 0.0085607 0.0324984 0.011536 0.395826 unknown
polarizability: 187.1943228|-6.865699|138.6621988|-11.6920161|-9.5307007|65.2015843 unknown
InChI: InChI=1S/C8H9N5O3/c9-6-5-7(11-2-10-6)13(3-12-5)1-4(14)8(15)16/h2-4,14-15H,1,9H2
charge 0 multiplicity 1
25 atoms
O  -2.674261 1.715692 -0.632857
O  -3.743647 -1.751807 -0.052604
O  -4.921623 0.254523 -0.162924
N  -0.144795 0.488131 0.363405
N  1.611788 1.881937 -0.136853
N  1.070296 -1.677877 0.459528
N  3.474007 -1.405932 0.006658
N  4.467364 0.688403 -0.459729
C  -1.491693 0.006768 0.686142
C  -2.487293 0.27977 -0.468283
C  0.991498 -0.328323 0.280914
C  2.062661 0.551592 -0.027005
C  0.28921 1.802203 0.10323
C  3.350176 -0.045781 -0.164062
C  -3.843168 -0.38178 -0.212549
C  2.35132 -2.131094 0.302979
H  -1.406122 -1.079528 0.863499
H  -1.861812 0.500967 1.602577
H  -2.070403 -0.144641 -1.4030
H  -0.411441 2.632275 0.077675
H  -3.649069 1.912855 -0.56252
H  2.50198 -3.207301 0.429416
H  5.362584 0.212216 -0.546669
H  4.391703 1.69488 -0.590211
H  -4.641358 -2.157148 0.092244
