program: Gaussian 09
title: 000146855
version: EM64L-G09RevD.01
frameworkgroup: C1[X(C15H23NO)]
method: RPBEPBE
basis: SDD
operation: Freq
keyword: #p
keyword: freq=noraman
keyword: PBEPBE/SDD
title: #p freq=noraman PBEPBE/SDD
converged: YES YES NO NO
title: Mulliken charges:
elementType: O N C C C C C C C C C C C C C C C H H H H H H H H H H H H H H H H H H H H H H H
charge: -0.428397 -0.112102 -0.013400 -0.615313 -0.622869 0.097539 0.342737 -0.318723 -0.382490 0.092948 -0.474379 -0.393451 -0.380465 -0.370544 -0.197791 -0.694932 -0.682257 0.212092 0.246670 0.216451 0.228695 0.236545 0.168938 0.224012 0.218370 0.221635 0.241928 0.215416 0.201192 0.208816 0.209992 0.246565 0.223529 0.208018 0.210857 0.220591 0.209490 0.206074 0.220143 0.357866
chargesum: 0.00000
title: Mulliken charges with hydrogens summed into heavy atoms:
elementType: O N C C C C C C C C C C C C C C C
charge: -0.070530 -0.112102 0.198693 -0.152192 -0.157628 0.097539 0.342737 0.074226 0.057515 0.092948 -0.232451 0.023158 0.038343 -0.123979 0.025738 -0.055467 -0.046549
polarizability: 2.18152581e+02 1.29950121e+00 1.80908725e+02 -4.49658440e+00 -1.10611626e+01 1.12208267e+02
1716.lowfreq: -9.1473 -0.0007 -0.0005 -0.0002 6.4876 10.7241 32.8523 44.2687 52.4781
frequency: 32.6437 44.2102 52.3007 69.3452 77.0507 85.3624 123.2161 163.9267 177.3176 202.1716 211.9086 225.0731 228.7244 249.7640 267.0171 278.1932 323.1343 337.6697 346.3569 376.7042 455.9543 488.8319 501.4394 513.0311 542.1998 557.7970 561.1652 596.8261 700.7921 707.6625 739.1322 758.6046 781.6329 814.9878 829.9232 855.2443 870.0803 878.4672 884.4888 892.4991 903.0503 934.9105 965.5664 972.2744 1026.2929 1036.3574 1043.0188 1045.6149 1069.7665 1075.7935 1088.7020 1104.2524 1127.5430 1130.1322 1136.9647 1168.7047 1178.3912 1184.1354 1189.3929 1204.0213 1219.6833 1246.0880 1252.9142 1267.8032 1278.4538 1286.2169 1298.0179 1302.2307 1303.9280 1313.0251 1326.2945 1344.1263 1354.7677 1380.3396 1387.3585 1392.2825 1402.7491 1450.9262 1454.8114 1466.4371 1468.8671 1470.5863 1475.1959 1476.1623 1477.7737 1478.9091 1480.7583 1489.3400 1493.3371 1603.6489 1627.8761 2835.3138 2844.2330 2955.2173 2970.0012 2971.0466 2973.8417 2978.3255 2981.2331 2996.5944 3012.1567 3018.9832 3023.1307 3039.9642 3047.0852 3051.7177 3067.6726 3071.4009 3072.8567 3076.5429 3128.8776 3148.5568 3170.7592 3576.5095
redmass: 3.9506 2.8975 3.5296 1.8883 1.8749 2.7284 3.2209 2.7959 3.2335 2.1697 1.2661 1.3222 2.8586 3.6546 3.2130 2.6686 2.9652 1.1258 2.3617 3.2865 3.0938 3.2468 3.6960 3.3936 3.3029 4.4035 3.8364 5.0273 3.1544 3.1686 1.1467 1.1160 1.4064 3.6555 4.2054 1.5908 1.6152 1.4811 1.5288 1.3626 1.5233 2.0233 1.3217 3.9213 1.9768 3.1793 2.2753 2.8751 2.2514 2.8770 2.1106 2.3921 1.4193 1.7049 1.2190 1.3108 2.5650 2.2685 1.8465 1.5618 1.4424 1.2584 1.4667 1.3262 1.7528 1.1108 1.3130 2.0150 1.2504 1.4228 1.2913 1.4467 1.3232 1.3926 1.2075 1.2456 5.9071 1.0985 1.4994 1.8357 1.1459 1.2083 1.7950 1.0794 1.0490 1.0879 1.0646 1.0825 1.0917 7.4693 7.4982 1.0766 1.0755 1.0584 1.0359 1.0637 1.0356 1.0593 1.0602 1.0602 1.1022 1.0992 1.0884 1.0981 1.1022 1.0974 1.1016 1.1011 1.0992 1.0993 1.0866 1.0935 1.0972 1.0658
irintensity: 0.0337 0.0151 0.0945 0.0472 0.1566 0.0928 0.5812 0.2546 0.7387 0.7532 0.0756 0.4270 0.3324 0.1946 0.1922 0.3771 3.0077 138.1741 0.3518 11.6797 6.4894 4.2731 1.4580 6.4676 2.7001 4.6176 5.8203 1.2661 13.7280 8.8126 6.5569 4.7822 60.1076 3.3836 0.1178 1.7472 5.1845 9.0025 6.5843 2.8986 1.7134 14.6268 0.7981 14.3108 6.0741 0.7334 24.3497 2.9853 56.9706 18.6012 5.2505 13.8524 112.7657 16.5239 18.6339 13.8462 42.2798 20.8344 13.5866 3.2812 1.8942 5.5166 9.5135 0.4905 13.8752 12.1686 2.1635 5.6407 1.8562 1.4956 0.7608 31.3648 5.8853 4.1790 14.6743 9.3946 4.9737 9.1332 11.6269 27.3088 7.7955 16.0959 1.6351 10.4506 8.7277 15.5282 4.5814 24.6437 3.0061 67.0439 11.0244 22.9412 125.7946 29.5377 44.5136 22.7105 40.0485 9.4538 11.3892 83.3515 24.3299 0.8181 7.2806 20.1783 15.1850 25.3085 96.8772 82.7051 42.4697 60.0945 5.4127 21.2353 16.5428 21.8001
temp: 298.150 k
press: 1.00000 atm
elementType: 8 7 6 6 6 6 6 6 6 6 6 6 6 6 6 6 6 1 1 1 1 1 1 1 1 1 1 1 1 1 1 1 1 1 1 1 1 1 1 1
symmnumber: 1
zpe: 913173.4 jmol-1
zpe.correction: 0.347809 hartree
zpe.thermalcorrener: 0.365854 hartree
zpe.thermalcorrenthalpy: 0.366798 hartree
zpe.thermalcorrgfe: 0.301216 hartree
zpe.sumelectzpe: -714.038911 hartree
zpe.sumelectthermal: -714.020867 hartree
zpe.sumelectthermalent: -714.019923 hartree
zpe.sumelectthermalfe: -714.085504 hartree
dipole: 2.9151 0.0923 0.5434
dipole: 2.9668
quadrupole: -109.7224 -98.9090 -108.0903
quadrupole: 4.8846 -0.4376 -2.3957
quadrupole: -4.1485 6.6649 -2.5164 4.8846 -0.4376 -2.3957
hfenergy: -714.3867203 hartree
pointgroup: C01 [X(C15H23N1O1)]
dipole: 1.1418936 0.0559613 0.2353021 debye
polarizability: 218.2108203|2.2363449|181.1799613|-2.3195583|-10.4392885|111.878791 unknown
InChI: InChI=1S/C15H23NO/c1-3-8-16(9-4-2)13-10-12-6-5-7-15(17)14(12)11-13/h5-7,13,17H,3-4,8-11H2,1-2H3
charge 0 multiplicity 1
40 atoms
O  -3.466612 2.115805 -0.581119
N  1.776607 -0.060535 -0.370351
C  0.427451 -0.098009 0.251841
C  -0.583331 0.892304 -0.418208
C  -0.27088 -1.49269 0.132572
C  -1.925549 0.21972 -0.176484
C  -1.752788 -1.148978 0.14392
C  2.690903 -1.082119 0.210616
C  2.36427 1.305569 -0.442658
C  -3.223754 0.764355 -0.256751
C  -2.862005 -1.980666 0.39202
C  4.049706 -1.191124 -0.512862
C  2.72677 1.999323 0.902926
C  -4.349541 -0.055131 -0.004002
C  -4.162096 -1.417357 0.317401
C  4.848563 -2.42396 -0.036315
C  3.311288 3.408987 0.668426
H  0.466741 0.155593 1.343204
H  -0.359111 0.957826 -1.503492
H  -0.509943 1.91197 0.009366
H  0.009746 -2.19085 0.940708
H  0.015691 -1.955993 -0.834093
H  2.874341 -0.914268 1.30423
H  2.186396 -2.061934 0.128301
H  3.272951 1.254085 -1.070877
H  1.656298 1.952698 -0.993281
H  -2.728639 -3.03859 0.642563
H  3.864818 -1.25516 -1.602732
H  4.655526 -0.280519 -0.340048
H  1.826512 2.074376 1.544505
H  3.46045 1.383598 1.459667
H  -5.349526 0.385228 -0.06216
H  -5.03992 -2.043289 0.513293
H  5.030886 -2.385992 1.054617
H  4.302648 -3.361367 -0.253385
H  5.830701 -2.481702 -0.539216
H  4.231152 3.362048 0.054912
H  2.588734 4.056826 0.136067
H  3.568189 3.905265 1.621788
H  -2.612041 2.589056 -0.73961
