program: Gaussian 09
title: 000146833
version: EM64L-G09RevD.01
frameworkgroup: C1[X(C15H14O)]
method: RPBEPBE
basis: SDD
operation: Freq
keyword: #pfreq=noraman
keyword: PBEPBE/SDD
title: #p freq=noraman PBEPBE/SDD
converged: YES YES NO NO
title: Mulliken charges:
elementType: O C C C C C C C C C C C C C C C H H H H H H H H H H H H H H
charge: -0.300655 -0.001574 -0.363623 -0.609438 0.494144 -0.406875 -0.418331 0.347603 -0.397976 -0.397009 0.342183 -0.397005 -0.396758 -0.234952 -0.235089 -0.241917 0.244505 0.212479 0.220979 0.230439 0.212975 0.233623 0.229269 0.237835 0.238352 0.237667 0.237480 0.225899 0.225697 0.230072
chargesum: 0.00000
title: Mulliken charges with hydrogens summed into heavy atoms:
elementType: O C C C C C C C C C C C C C C C
charge: -0.300655 0.242931 0.069836 -0.166024 0.494144 -0.173252 -0.189061 0.347603 -0.160141 -0.158657 0.342183 -0.159338 -0.159278 -0.009052 -0.009392 -0.011845
polarizability: 2.64191463e+02 3.17201057e+00 1.52051724e+02 -1.26586332e+01 6.81308710e+00 8.79312939e+01
1716.lowfreq: -12.1638 -1.4941 -0.0004 -0.0001 0.0005 7.0857 14.9640 36.9778 56.5244
frequency: 12.0630 36.9675 56.4852 68.6363 108.3417 113.9032 212.0842 251.9604 273.0157 343.0193 372.3736 377.5166 404.7477 410.1314 434.4013 500.2661 553.4892 592.8878 614.8072 639.2667 701.9497 706.4613 717.7462 752.3105 772.5739 782.7554 815.9066 847.0838 848.4859 851.2947 874.6730 918.3775 938.5229 961.5460 971.6070 973.7687 988.6728 993.6856 996.4871 1017.0661 1018.7894 1041.2474 1044.6984 1084.9729 1102.0657 1119.3704 1130.9341 1173.5647 1190.4423 1193.0922 1200.3108 1218.3793 1241.7340 1289.9717 1301.1575 1304.5127 1318.9937 1363.2768 1374.4203 1390.2741 1412.4217 1438.9695 1466.3640 1477.4036 1483.0648 1517.4420 1568.3764 1589.1527 1613.3009 1622.8338 2999.1530 3056.9652 3061.6033 3088.2677 3115.8055 3118.0701 3122.9508 3127.4303 3140.0648 3141.6519 3148.1080 3149.3912 3165.2533 3168.3922
redmass: 3.3992 5.6462 4.2073 3.6804 4.9893 4.0740 4.7784 6.4569 3.8305 4.1939 4.4624 2.4305 2.8481 2.8739 2.9378 3.4054 2.8663 5.0013 6.4462 6.6361 1.7310 5.1628 4.6667 2.9094 2.4340 3.9519 3.1837 1.4801 1.3844 1.4148 1.2374 1.4527 2.0226 1.4114 1.4035 1.4375 4.9190 1.3146 6.6190 1.7246 1.7060 1.9003 1.7275 1.6177 1.2889 1.3340 1.3574 1.0524 1.1147 1.4261 1.1721 2.2456 1.5026 3.0292 1.4971 1.4350 1.3133 2.8507 8.3517 1.9872 3.5240 2.3878 1.1195 2.1291 1.1997 2.8753 5.9384 6.5023 6.0499 6.4057 1.0605 1.0987 1.0540 1.0926 1.0878 1.0876 1.0845 1.0875 1.0922 1.0951 1.0962 1.0962 1.1016 1.1187
irintensity: 0.2510 0.5028 4.1434 0.0036 3.8113 0.4068 0.2969 4.4508 1.6785 7.5989 8.1347 0.1522 0.2591 0.1201 0.9835 19.0313 4.9496 0.7361 0.0149 0.2114 47.3636 10.4409 6.6007 55.1646 42.4696 59.3105 8.5496 13.7814 6.7358 6.6036 0.4663 2.2156 9.5359 1.0194 0.5004 0.3409 0.3144 0.0687 9.7436 0.3031 0.3312 3.3383 8.1499 8.3064 6.0321 1.9591 11.3021 0.0317 2.2119 9.4081 0.1203 0.3789 5.7861 0.0236 1.3719 3.7742 0.5659 3.1354 0.2880 21.4617 5.3042 3.7861 10.2102 55.3157 4.3539 10.0628 1.1928 1.3973 8.3725 0.1789 26.9933 3.6301 29.2197 19.8930 9.4965 32.8832 2.5646 1.6740 14.5135 18.3213 1.1619 49.0267 25.4424 33.0948
temp: 298.150 k
press: 1.00000 atm
elementType: 8 6 6 6 6 6 6 6 6 6 6 6 6 6 6 6 1 1 1 1 1 1 1 1 1 1 1 1 1 1
symmnumber: 1
zpe: 638219.6 jmol-1
zpe.correction: 0.243085 hartree
zpe.thermalcorrener: 0.256709 hartree
zpe.thermalcorrenthalpy: 0.257653 hartree
zpe.thermalcorrgfe: 0.200022 hartree
zpe.sumelectzpe: -654.050745 hartree
zpe.sumelectthermal: -654.037122 hartree
zpe.sumelectthermalent: -654.036177 hartree
zpe.sumelectthermalfe: -654.093809 hartree
dipole: 2.3637 0.7455 -0.2431
dipole: 2.4904
quadrupole: -107.4082 -82.3447 -96.5993
quadrupole: -4.0159 -1.5477 1.7281
quadrupole: -11.9574 13.1060 -1.1485 -4.0159 -1.5477 1.7281
hfenergy: -654.2938304 hartree
pointgroup: C01 [X(C15H14O1)]
dipole: -0.9290451 0.3111703 -0.0075411 debye
polarizability: 264.2448691|-7.3065177|141.3713783|-10.3068195|-24.8800676|98.5582332 unknown
InChI: InChI=1S/C15H14O/c1-2-4-13(5-3-1)14-8-6-12(7-9-14)10-15-11-16-15/h1-9,15H,10-11H2
charge 0 multiplicity 1
30 atoms
O  5.763752 0.201164 0.414331
C  4.268376 0.068119 0.595838
C  4.858549 1.404722 0.271073
C  3.539308 -0.770017 -0.450553
C  2.029823 -0.583016 -0.363851
C  1.257324 -1.325362 0.565942
C  1.358157 0.36352 -1.178275
C  -0.810823 -0.181998 -0.138121
C  -0.134118 -1.129901 0.677733
C  -0.033795 0.559509 -1.070277
C  -2.284332 0.021826 -0.027571
C  -3.150146 -1.058145 0.30117
C  -2.865756 1.301106 -0.250075
C  -4.54448 -0.867023 0.403899
C  -4.260124 1.49367 -0.150143
C  -5.108102 0.410282 0.177752
H  3.974949 -0.120182 1.638423
H  4.771059 1.791098 -0.752869
H  4.966028 2.160598 1.058608
H  3.806897 -1.83178 -0.290048
H  3.915555 -0.488673 -1.451006
H  1.751139 -2.066092 1.207474
H  1.928683 0.939821 -1.917091
H  -0.698748 -1.700277 1.423935
H  -0.529342 1.271026 -1.740524
H  -2.732183 -2.060948 0.44559
H  -2.218488 2.157039 -0.472844
H  -5.192238 -1.716149 0.649497
H  -4.683988 2.490214 -0.318075
H  -6.190735 0.559051 0.255758
