program: Gaussian 09
title: 000146834
version: EM64L-G09RevD.01
frameworkgroup: C1[X(C9H10N4O4)]
method: RPBEPBE
basis: SDD
operation: Freq
keyword: #p
keyword: freq=noraman
keyword: PBEPBE/SDD
title: #p freq=noraman PBEPBE/SDD
converged: YES YES NO NO
title: Mulliken charges:
elementType: O O O O N N N N C C C C C C C C C H H H H H H H H H H
charge: -0.434906 -0.461063 -0.195667 -0.220045 -0.047923 -0.378124 -0.007158 -0.396878 -0.247472 -0.129707 0.363464 -0.083518 -0.712277 0.139582 -0.415564 0.148024 0.154123 0.228464 0.246639 0.231177 0.246364 0.210249 0.268347 0.369697 0.363275 0.376562 0.384337
chargesum: 0.00000
title: Mulliken charges with hydrogens summed into heavy atoms:
elementType: O O O O N N N N C C C C C C C C C
charge: -0.071631 -0.076725 -0.195667 -0.220045 -0.047923 -0.008427 -0.007158 -0.020316 -0.019008 0.116932 0.363464 -0.083518 -0.024487 0.139582 -0.147217 0.148024 0.154123
polarizability: 2.09072749e+02 6.37121273e+00 1.40969697e+02 3.25689481e+00 -6.50238088e+00 8.05501208e+01
1716.lowfreq: -4.5160 -3.8119 -0.0007 -0.0007 0.0001 9.3942 32.7453 50.6217 96.9518
frequency: 32.5075 50.5801 96.9412 109.2695 140.5000 146.7330 162.6348 201.1515 216.3320 248.7365 252.9967 334.1225 339.0917 366.8127 396.9976 429.8024 450.7238 473.1267 500.5952 521.4831 549.8998 572.0298 587.2116 629.3692 660.4525 669.5593 699.7404 706.8844 733.4111 747.9792 779.1184 805.0567 810.9429 869.1693 891.5300 933.5735 940.4729 962.5862 973.2068 1021.7522 1092.0661 1097.2631 1120.5484 1180.2296 1199.0754 1216.6965 1250.4942 1266.3034 1277.9065 1307.1599 1324.8615 1361.4934 1371.2636 1374.2292 1384.8587 1390.1413 1398.0839 1408.8929 1463.7075 1473.6504 1482.0217 1521.6384 1542.5968 1646.2910 1683.4313 2985.5284 3038.3171 3047.6817 3080.7830 3100.0675 3155.7013 3365.9609 3410.5655 3520.0366 3534.7347
redmass: 6.5734 6.5404 4.6537 5.3820 5.4429 6.9525 6.0630 4.1417 1.2960 5.4031 4.8234 4.8893 8.5975 5.9217 5.3640 5.8845 6.3614 7.5862 3.7497 6.6186 1.0958 6.2061 4.0959 6.0270 6.8349 1.8047 1.9107 1.3728 2.9977 3.2291 1.8631 3.6128 7.8751 4.3181 2.6268 1.7541 3.9350 3.4044 3.2215 1.8303 2.4706 5.1420 1.7529 3.4762 2.0248 1.6892 2.4648 1.8912 7.8355 1.5711 2.1906 1.5662 1.2679 1.5987 3.3127 1.2385 1.3735 1.7528 1.0568 5.9844 1.0673 4.7562 8.8900 8.2780 5.7618 1.0372 1.0857 1.0871 1.0973 1.0995 1.0935 1.0654 1.0646 1.0770 1.0779
irintensity: 0.7924 0.8833 2.0456 3.5046 6.8914 1.9798 2.5188 3.0164 2.3170 3.1787 7.0078 7.0861 15.0375 6.7388 0.4529 7.8028 12.4161 25.5470 8.1556 3.0126 37.3151 0.8356 11.5016 16.4316 19.2400 50.2175 9.3256 234.0163 62.9814 25.3250 159.4397 35.1731 16.4658 12.1398 29.8912 23.3037 25.0105 30.9053 7.3685 50.4062 3.6948 15.9516 49.1688 44.3523 31.9322 59.0674 28.1563 11.1293 59.8696 36.4902 184.2785 16.6053 32.7266 7.6222 32.2059 40.7932 47.0669 5.2922 5.3457 117.9218 7.0567 49.4091 83.3895 261.0469 833.7353 16.5058 11.4543 30.2699 35.1724 37.7267 6.9908 129.9181 68.6308 82.8008 94.1910
temp: 298.150 k
press: 1.00000 atm
elementType: 8 8 8 8 7 7 7 7 6 6 6 6 6 6 6 6 6 1 1 1 1 1 1 1 1 1 1
symmnumber: 1
zpe: 520910.1 jmol-1
zpe.correction: 0.198404 hartree
zpe.thermalcorrener: 0.213210 hartree
zpe.thermalcorrenthalpy: 0.214154 hartree
zpe.thermalcorrgfe: 0.156157 hartree
zpe.sumelectzpe: -867.643473 hartree
zpe.sumelectthermal: -867.628667 hartree
zpe.sumelectthermalent: -867.627723 hartree
zpe.sumelectthermalfe: -867.685720 hartree
dipole: 0.1059 -2.7711 2.6450
dipole: 3.8322
quadrupole: -112.6507 -105.4024 -98.5641
quadrupole: 4.8028 -9.6688 -1.5348
quadrupole: -7.1116 0.1366 6.9750 4.8028 -9.6688 -1.5348
hfenergy: -867.8418769 hartree
pointgroup: C01 [X(C9H10N4O4)]
dipole: -0.0601778 -1.3293232 -0.7088529 debye
polarizability: 208.8086596|-6.3820275|140.1606334|5.4628181|-10.2369337|81.6232741 unknown
InChI: InChI=1S/C9H10N4O4/c1-3(14)6(15)4-2-10-7-5(11-4)8(16)13-9(17)12-7/h2-3,6,12-15H,1H3
charge 0 multiplicity 1
27 atoms
O  3.33599 -0.573941 1.749431
O  3.259968 1.61784 0.066308
O  -0.841211 2.604534 -0.438122
O  -4.696159 -0.036155 -0.150185
N  0.807447 0.262699 -0.014834
N  -2.61665 -1.090552 0.065223
N  -0.554867 -2.215407 0.286884
N  -2.732341 1.242177 -0.284557
C  3.017221 -0.808673 0.328347
C  3.666557 0.322165 -0.517899
C  1.503549 -0.896588 0.185287
C  -0.548726 0.205218 -0.058831
C  3.395421 0.240922 -2.027173
C  -1.228208 -1.040228 0.099744
C  0.799565 -2.129237 0.328201
C  -1.328403 1.458759 -0.276402
C  -3.443609 0.031302 -0.123921
H  3.4720 -1.784132 0.080888
H  4.753759 0.277063 -0.327054
H  2.319191 0.333625 -2.256426
H  3.923842 1.063683 -2.537674
H  3.762042 -0.715591 -2.445988
H  1.343174 -3.066306 0.483176
H  -3.075626 -1.998083 0.18737
H  3.321703 0.422124 1.851487
H  -3.317953 2.072535 -0.425282
H  2.268324 1.691347 -0.064098
