program: Gaussian 09
title: 000146846
version: EM64L-G09RevD.01
frameworkgroup: C1[X(C14H11NO3)]
method: RPBEPBE
basis: SDD
operation: Freq
keyword: #p
keyword: freq=noraman
keyword: PBEPBE/SDD
title: #p freq=noraman PBEPBE/SDD
converged: YES YES NO NO
title: Mulliken charges:
elementType: O O O N C C C C C C C C C C C C C C H H H H H H H H H H H
charge: -0.259510 -0.384397 -0.317599 -0.170591 -0.205339 0.546849 0.135273 0.232384 0.218259 -0.325221 -0.444319 -0.340781 -0.367791 -0.243128 -0.196497 -0.229916 -0.225124 -0.229349 0.244962 0.251126 0.231056 0.272699 0.259479 0.236446 0.235770 0.230200 0.230639 0.232142 0.382277
chargesum: 0.00000
title: Mulliken charges with hydrogens summed into heavy atoms:
elementType: O O O N C C C C C C C C C C C C C C
charge: -0.259510 -0.002120 -0.317599 -0.170591 0.039623 0.546849 0.135273 0.232384 0.218259 -0.074095 -0.213264 -0.068082 -0.108312 -0.006682 0.039274 0.000285 0.005515 0.002793
polarizability: 2.52584788e+02 -4.08985277e+00 1.48978901e+02 2.24060955e+00 4.05822894e+00 1.08468658e+02
1716.lowfreq: -7.0791 -0.0005 0.0002 0.0006 5.2495 8.1183 22.2109 41.6736 67.2185
frequency: 22.1451 41.6617 67.2118 95.9294 115.9906 188.8805 202.7293 235.6372 252.2888 270.4139 298.0709 324.0696 401.6856 408.4087 426.2271 470.6569 472.1443 495.7321 525.5814 555.8275 587.7974 614.6915 639.6040 658.5279 671.1048 699.4333 748.9964 762.7196 768.5876 775.4364 815.6219 852.4859 855.1416 879.7410 910.6867 927.9881 939.6672 964.8242 978.9898 992.2537 993.2348 1000.1801 1025.4532 1026.7978 1080.3770 1088.2405 1109.3821 1153.0586 1163.4401 1174.7583 1187.5283 1194.7159 1220.5780 1245.8989 1284.2940 1310.4975 1333.1970 1356.2479 1390.8363 1395.7509 1434.9217 1447.4901 1454.6032 1462.4806 1487.5407 1562.7886 1591.5936 1601.9497 1616.6227 1618.8061 2938.8291 3122.8809 3132.2456 3140.2843 3145.0159 3153.6162 3157.0469 3168.4694 3169.3060 3178.3662 3195.1885
redmass: 3.9313 5.5289 5.5263 7.4160 6.2567 6.2809 6.5183 4.7215 5.2990 6.0983 5.9524 6.6830 3.0053 7.0374 3.4463 3.9518 8.1219 1.4416 2.4659 7.3707 5.0336 6.4362 6.3090 6.4128 4.4851 1.7421 3.8303 2.2193 5.8844 1.3604 4.7447 1.2534 3.9260 1.4698 4.7411 3.1757 2.5203 1.3711 1.3978 6.1354 1.3292 1.3341 2.1058 2.1232 1.9178 2.4207 3.1354 2.1756 1.2200 1.0547 1.1199 2.0971 2.1348 1.6572 1.3973 1.5180 2.5499 1.5888 9.0912 4.9362 1.8547 2.1844 2.2589 2.7749 2.4078 6.6490 7.7119 6.1777 6.9730 6.2146 1.0848 1.0873 1.0874 1.0863 1.0915 1.0904 1.0964 1.0953 1.1014 1.0999 1.0635
irintensity: 0.1453 0.4136 0.8802 1.4551 1.8062 3.1095 6.2406 0.3162 3.1041 0.1968 12.0683 24.1637 0.4059 0.6386 9.8101 6.6376 2.9052 49.3212 44.5457 0.6402 10.0914 0.1379 25.7536 13.9503 33.2979 47.9628 36.7550 77.0432 15.4696 68.0661 2.8546 0.2543 18.9915 3.2256 68.6566 22.7817 44.2300 3.5885 0.0375 1.2082 0.2352 0.1992 21.4610 1.0507 31.2574 44.3471 29.7874 3.7712 13.6277 0.3874 13.3898 50.8504 60.3544 21.4436 46.4093 35.8123 214.1267 66.5143 17.5907 14.1469 80.4208 50.5394 96.5354 9.7308 0.6626 80.1672 110.4477 1.5423 59.0554 2.4285 52.2600 5.1632 1.1871 3.4563 19.0236 6.1094 30.6871 10.2757 17.4553 15.2018 38.6491
temp: 298.150 k
press: 1.00000 atm
elementType: 8 8 8 7 6 6 6 6 6 6 6 6 6 6 6 6 6 6 1 1 1 1 1 1 1 1 1 1 1
symmnumber: 1
zpe: 570798.8 jmol-1
zpe.correction: 0.217406 hartree
zpe.thermalcorrener: 0.231789 hartree
zpe.thermalcorrenthalpy: 0.232733 hartree
zpe.thermalcorrgfe: 0.174795 hartree
zpe.sumelectzpe: -819.208847 hartree
zpe.sumelectthermal: -819.194464 hartree
zpe.sumelectthermalent: -819.193520 hartree
zpe.sumelectthermalfe: -819.251458 hartree
dipole: -0.3908 -2.7760 -0.8970
dipole: 2.9434
quadrupole: -85.4940 -108.7450 -99.2071
quadrupole: -4.9079 -0.4935 0.8954
quadrupole: 12.3213 -10.9296 -1.3917 -4.9079 -0.4935 0.8954
hfenergy: -819.4262527 hartree
pointgroup: C01 [X(C14H11N1O3)]
dipole: -0.1490583 -0.8976414 -0.7162735 debye
polarizability: 252.6367137|-3.9398952|141.1740581|0.431036|16.4525864|116.221575 unknown
InChI: InChI=1S/C14H11NO3/c16-13-11-8-4-5-9-12(11)18-14(15(13)17)10-6-2-1-3-7-10/h1-9,14,17H
charge 0 multiplicity 1
29 atoms
O  0.200091 -1.040509 -0.295083
O  -0.898366 2.337771 0.721343
O  1.703075 2.572083 1.110586
N  -0.036832 1.198701 0.484713
C  -0.58717 0.213451 -0.473194
C  -2.03935 -0.113488 -0.227233
C  2.193967 0.339673 0.177062
C  1.602461 -0.880603 -0.250711
C  1.326314 1.454656 0.609956
C  -2.487054 -0.454466 1.071931
C  -2.946696 -0.115423 -1.309976
C  3.604471 0.448754 0.23362
C  2.400726 -1.992197 -0.586956
C  4.411314 -0.650893 -0.117501
C  3.805573 -1.869601 -0.518754
C  -3.837858 -0.798159 1.281661
C  -4.301048 -0.459069 -1.100006
C  -4.747335 -0.80193 0.196329
H  -0.427084 0.568743 -1.515672
H  -1.778561 -0.439834 1.90667
H  -2.597787 0.152313 -2.314886
H  4.035233 1.397094 0.570986
H  1.918257 -2.922825 -0.899052
H  5.501742 -0.569159 -0.073421
H  4.43135 -2.727929 -0.786304
H  -4.185674 -1.059486 2.286907
H  -5.002816 -0.457973 -1.940848
H  -5.797443 -1.067364 0.362311
H  -0.219401 3.010867 1.066421
