program: Gaussian 09
title: 000146835
version: EM64L-G09RevD.01
frameworkgroup: C1[X(C16H20N2O3S3)]
method: RPBEPBE
basis: SDD
operation: Freq
keyword: #p
keyword: freq=noraman
keyword: PBEPBE/SDD
title: #p freq=noraman PBEPBE/SDD
converged: YES YES NO NO
title: Mulliken charges:
elementType: S S S O O O N N C C C C C C C C C C C C C C C C H H H H H H H H H H H H H H H H H H H H
charge: 0.815075 0.301113 0.145049 -0.536387 -0.535585 -0.233136 -0.374554 -0.073167 0.478797 0.058794 0.437547 -0.578598 -0.331829 -0.731710 -0.635046 -0.669116 -0.489141 -0.815364 0.355343 0.409905 -0.391719 -0.376815 -0.611040 -0.620083 0.287101 0.315401 0.237078 0.245222 0.280408 0.298182 0.260924 0.272769 0.229947 0.198641 0.274314 0.284525 0.262042 0.257803 0.185687 0.227495 0.228591 0.182326 0.226776 0.246433
chargesum: 0.00000
title: Mulliken charges with hydrogens summed into heavy atoms:
elementType: S S S O O O N N C C C C C C C C C C C C C C C C
charge: 0.815075 0.301113 0.145049 -0.536387 -0.535585 -0.233136 -0.059153 -0.073167 0.478797 0.058794 0.437547 -0.291497 0.150471 -0.451302 -0.336864 -0.135423 -0.060553 -0.256525 0.355343 0.409905 -0.129676 -0.119011 0.030733 0.035452
polarizability: 3.65320900e+02 2.36539279e+01 2.69250926e+02 -4.24296657e+00 -5.90081937e+00 1.75681852e+02
1716.lowfreq: -5.0978 -2.1907 0.0013 0.0017 0.0018 5.2040 7.4236 9.1479 17.8928
frequency: 5.6957 8.4967 17.7482 26.8945 32.3082 54.8014 65.3900 69.8319 84.5222 92.0593 97.0749 104.2701 122.2035 166.1743 171.4669 185.5519 207.5760 227.3331 234.5201 240.9725 250.7951 267.8202 287.5937 303.7720 312.4709 329.5691 355.2339 355.9161 377.7605 393.6481 407.2233 429.9757 448.9291 464.0577 511.4651 554.4352 559.9828 578.2563 587.4067 617.7441 627.0601 665.8670 672.1777 677.2865 697.7383 713.8162 735.1984 748.1887 755.2451 782.4608 789.9911 798.9958 802.8638 805.7469 815.7618 840.7359 856.4812 871.4745 921.3327 927.1135 940.3355 941.9728 971.4364 990.1714 1014.0503 1022.7998 1024.7653 1036.2255 1082.4148 1091.2063 1103.4008 1125.5969 1126.4615 1154.5759 1163.8656 1178.6901 1193.5521 1204.0868 1210.6750 1213.3782 1231.9774 1256.2482 1260.3729 1282.0811 1285.3837 1299.5700 1349.4067 1355.9421 1363.9730 1372.0622 1417.9426 1437.2954 1439.9789 1447.3015 1451.8144 1459.8444 1471.4611 1475.1646 1477.9560 1481.2158 1485.0370 1530.1520 1551.8027 1562.7972 1595.8447 1601.3389 2834.8873 2841.0542 2858.8176 2952.4975 3006.9220 3011.7176 3019.6729 3024.9413 3030.2250 3035.6626 3079.6239 3089.0172 3100.3173 3113.4772 3216.9170 3224.1385 3235.7071 3249.5261 3249.6885 3467.1682
redmass: 7.4190 5.4707 5.7191 4.6375 3.0617 6.4770 6.2659 3.3417 4.6085 9.8775 6.2221 5.5981 5.8933 6.0834 5.3449 4.7604 1.8581 1.8188 1.5728 2.3767 2.4862 2.9826 5.7259 4.9167 2.7890 3.5310 7.3298 2.6646 2.1913 5.0568 15.5119 4.1231 2.6495 10.8472 4.5820 1.7475 3.2217 2.3146 5.5857 4.1229 4.2414 4.6228 4.3862 1.9569 1.7959 4.8035 2.4361 6.3406 4.3119 5.3599 1.3974 2.2393 5.6010 3.2546 1.8022 2.3629 2.0243 1.4246 2.5470 19.4993 5.3584 3.4524 2.4445 2.0004 1.5335 1.8278 1.4789 1.5181 2.6202 1.2490 1.2835 1.6165 1.3935 1.2500 1.7854 1.3684 1.4583 2.5122 1.3801 1.7991 1.3927 2.4806 2.3015 1.6167 1.8153 1.2867 1.7921 2.2651 1.5762 2.6619 1.1410 1.1276 1.1587 1.0960 1.0900 1.0467 1.0598 1.0573 1.9415 1.0798 1.0530 6.7710 8.4632 7.9021 6.5840 8.4137 1.0689 1.0577 1.0591 1.0627 1.0894 1.0859 1.0718 1.0671 1.0713 1.0571 1.1011 1.1011 1.1072 1.1088 1.0939 1.0961 1.1043 1.0980 1.0968 1.0774
irintensity: 1.1395 0.2766 0.7713 0.8374 0.5873 1.4234 0.9600 3.4359 2.6937 1.1313 0.4037 0.7384 1.7433 6.9172 0.7577 1.3175 0.3404 1.8587 1.4810 4.0669 3.4787 0.8154 18.3794 2.4987 5.5987 7.1091 3.4302 1.6253 3.2756 10.8545 46.6579 2.8613 2.3314 28.0455 1.7489 52.0272 7.2803 34.8102 29.1753 0.8287 3.7084 34.4631 15.1962 40.6160 15.0128 8.6917 4.7052 7.7591 15.4072 28.9180 74.4957 50.0886 94.6229 72.5336 43.6829 7.1815 2.4637 0.9086 7.5813 108.8397 3.2419 5.3243 12.4259 24.3261 7.0116 32.9608 57.1890 12.4695 17.1985 6.7235 7.0707 3.5458 6.4628 0.3187 5.1694 7.5357 9.9507 0.4258 44.2492 24.1339 14.3562 10.5577 14.8983 9.3542 5.5229 8.1939 0.4401 8.1705 30.3716 50.7933 3.4446 6.4657 5.4273 12.6293 4.0562 16.2066 11.2194 15.7242 153.3373 75.3178 12.6250 79.7228 19.1326 104.0232 0.2206 378.7656 61.4490 70.1496 273.8663 33.3235 2.8849 21.6858 37.7266 41.4767 32.0358 11.5653 26.1446 39.4699 18.0190 1.3278 7.2439 0.9145 0.2875 10.5099 16.9251 267.4724
temp: 298.150 k
press: 1.00000 atm
elementType: 16 16 16 8 8 8 7 7 6 6 6 6 6 6 6 6 6 6 6 6 6 6 6 6 1 1 1 1 1 1 1 1 1 1 1 1 1 1 1 1 1 1 1 1
symmnumber: 1
zpe: 876205.3 jmol-1
zpe.correction: 0.333729 hartree
zpe.thermalcorrener: 0.359713 hartree
zpe.thermalcorrenthalpy: 0.360657 hartree
zpe.thermalcorrgfe: 0.271254 hartree
zpe.sumelectzpe: -2149.001660 hartree
zpe.sumelectthermal: -2148.975676 hartree
zpe.sumelectthermalent: -2148.974732 hartree
zpe.sumelectthermalfe: -2149.064135 hartree
dipole: 10.7535 2.9054 -2.8614
dipole: 11.5007
quadrupole: -211.2855 -150.1595 -171.5694
quadrupole: -14.7367 6.5783 4.9008
quadrupole: -33.6140 27.5120 6.1020 -14.7367 6.5783 4.9008
hfenergy: -2149.3353892 hartree
pointgroup: C01 [X(C16H20N2O3S3)]
dipole: -4.2968474 1.4152264 -0.0866448 debye
polarizability: 365.2708181|-12.9279697|233.7286073|21.2194726|-45.4379091|211.254253 unknown
InChI: InChI=1S/C16H20N2O3S3/c1-18(2)7-12-3-4-13(21-12)8-22-6-5-17-15-11-24(19,20)16-10-23-9-14(15)16/h3-4,9-11,17H,5-8H2,1-2H3
charge 0 multiplicity 1
44 atoms
S  6.102783 -0.70147 0.525543
S  4.431515 2.644126 -1.990754
S  -1.021583 -0.710464 0.805958
O  7.050916 -0.080099 1.701123
O  6.733528 -1.867615 -0.427249
O  -4.464243 0.135581 0.697652
N  2.075483 -0.414763 0.967105
N  -6.578133 -1.304341 -1.074886
C  3.895362 0.698911 -0.286162
C  5.316431 0.689359 -0.513617
C  3.411081 -0.343726 0.653576
C  4.407288 -1.162884 1.153816
C  1.512917 -1.446368 1.84343
C  3.258746 1.695147 -1.006775
C  5.802275 1.632618 -1.374769
C  0.102031 -1.050475 2.30784
C  -6.674255 0.033032 -0.440072
C  -2.228013 0.541322 1.653298
C  -5.348247 0.702729 -0.244026
C  -3.313846 0.955472 0.736481
C  -4.770635 1.848928 -0.774588
C  -3.475053 2.009385 -0.154565
C  -7.850578 -2.045662 -0.987935
C  -6.040301 -1.257368 -2.447861
H  4.366325 -2.017154 1.824748
H  1.387646 0.112074 0.417296
H  2.16035 -1.554069 2.73643
H  1.491022 -2.433423 1.333653
H  2.204637 1.964607 -1.05468
H  6.815409 1.838885 -1.711032
H  0.141606 -0.122328 2.904969
H  -0.34411 -1.859033 2.908458
H  -7.164698 -0.102903 0.543389
H  -7.314844 0.739476 -1.030894
H  -1.621595 1.407433 1.961256
H  -2.632868 0.026534 2.539231
H  -5.222486 2.499573 -1.520753
H  -2.753923 2.802494 -0.343001
H  -8.689916 -1.565951 -1.554982
H  -8.159014 -2.137279 0.069146
H  -7.70976 -3.064226 -1.390709
H  -6.700082 -0.69903 -3.161919
H  -5.916983 -2.286796 -2.827346
H  -5.049384 -0.772158 -2.446521
