program: Gaussian 09
title: 000146826
version: EM64L-G09RevD.01
frameworkgroup: C1[X(C14H15N3O)]
method: RPBEPBE
basis: SDD
operation: Freq
keyword: #p
keyword: freq=noraman
keyword: PBEPBE/SDD
title: #p freq=noraman PBEPBE/SDD
converged: YES YES NO NO
title: Mulliken charges:
elementType: O N N N C C C C C C C C C C C C C C H H H H H H H H H H H H H H H
charge: -0.278144 -0.324621 -0.226273 -0.110139 -0.488079 -0.427790 0.283519 -0.388937 -0.010541 -0.057911 0.353512 -0.319285 0.111441 -0.340165 -0.768964 -0.231480 -0.219241 -0.210216 0.205863 0.240489 0.210720 0.229570 0.220554 0.222228 0.290474 0.306625 0.251684 0.232871 0.273982 0.227527 0.274904 0.235983 0.229837
chargesum: 0.00000
title: Mulliken charges with hydrogens summed into heavy atoms:
elementType: O N N N C C C C C C C C C C C C C C
charge: -0.278144 -0.017996 -0.226273 -0.110139 -0.041727 0.012500 0.283519 0.053846 -0.010541 -0.057911 0.353512 -0.028810 0.111441 -0.088481 -0.034584 0.043424 0.016742 0.019621
polarizability: 2.48826544e+02 9.62539423e+00 2.03313643e+02 -1.38132317e+01 5.73190095e+00 1.07372779e+02
1716.lowfreq: -6.3259 -3.8445 -0.0005 -0.0001 0.0003 8.0900 44.2316 53.8136 63.9454
frequency: 44.1613 53.7820 63.9422 72.3729 96.2789 133.2671 147.4042 179.0382 222.8406 243.6438 269.4401 289.0148 305.7679 323.1510 377.2985 403.7327 435.6309 459.3802 467.9897 497.9165 536.7000 553.3680 574.0152 588.9197 637.6339 650.2703 686.3353 715.0041 745.1759 753.9777 765.3851 835.1842 841.8817 845.9511 870.2531 893.1587 931.5344 933.1661 939.4940 951.6573 968.5244 996.3595 1005.3990 1012.2505 1049.1097 1062.7097 1082.3194 1101.6089 1121.3239 1153.5742 1173.9842 1183.4311 1187.8637 1219.0595 1262.6370 1272.2398 1303.2621 1314.9455 1333.5019 1337.0255 1345.1397 1352.4304 1362.5321 1391.4946 1407.0325 1433.8479 1450.6722 1461.5874 1462.6818 1467.5920 1475.2801 1481.4028 1491.0880 1505.2277 1526.7336 1532.6416 1627.4610 1633.5266 2956.8342 2971.0754 2992.1655 3001.0798 3034.9716 3040.4673 3068.4971 3077.7550 3116.0323 3147.1372 3150.4095 3173.4973 3182.1548 3207.1460 3581.9337
redmass: 4.0285 4.0672 3.1518 1.1770 3.2123 3.5438 4.3905 4.5578 3.6139 3.7571 2.9152 2.6368 4.5549 4.6258 7.3689 1.6206 2.9369 3.7393 2.1582 5.5879 3.5942 2.8217 4.3552 4.4992 5.9423 5.4597 5.7213 5.4014 1.8324 1.7470 3.6524 5.0723 1.4510 3.7975 1.5377 2.9394 1.6328 1.6166 3.1366 2.2846 1.2862 2.7041 1.9094 1.9823 1.5111 2.0028 1.8033 2.3982 2.4983 1.6153 1.1907 1.8213 1.4295 1.7999 1.9214 1.3162 1.3340 2.0470 1.4143 2.5877 1.6840 2.0539 2.7471 1.3735 2.8540 3.3304 1.2261 1.1721 1.1152 2.2155 1.2131 1.2948 4.5123 1.8566 5.3317 6.0320 6.2524 6.1868 1.0662 1.0650 1.0387 1.0622 1.0957 1.0938 1.1045 1.0939 1.1009 1.0927 1.0875 1.0910 1.0963 1.0991 1.0784
irintensity: 2.9615 0.9139 0.9587 0.9275 0.9091 2.3574 2.6904 1.5888 0.8927 10.9769 4.3865 1.2277 4.8166 0.8748 0.5943 101.5690 14.7546 9.2593 12.1660 0.6961 12.4612 2.0430 6.3530 13.0962 1.2178 3.8591 1.5285 14.4982 40.1491 49.1448 20.1658 9.2375 0.7075 27.5358 28.3814 42.8164 8.5699 6.1906 32.7645 5.7423 0.6809 16.3199 1.6423 11.6473 6.1294 6.4655 9.3084 4.2729 31.7412 3.3718 2.1618 57.4175 16.1432 149.6699 6.9665 8.4390 18.6267 1.5673 19.6583 31.3666 65.0067 41.3760 31.7488 24.0767 63.4079 134.9997 42.8805 19.8225 3.3060 6.7641 11.3077 13.1938 161.0339 176.7177 176.0556 5.6706 271.2883 182.7143 68.1880 35.2107 20.2071 20.3064 34.4119 41.5808 40.5646 14.6751 9.9206 1.5797 4.6697 8.1709 7.9785 4.8469 74.0502
temp: 298.150 k
press: 1.00000 atm
elementType: 8 7 7 7 6 6 6 6 6 6 6 6 6 6 6 6 6 6 1 1 1 1 1 1 1 1 1 1 1 1 1 1 1
symmnumber: 1
zpe: 697337.8 jmol-1
zpe.correction: 0.265602 hartree
zpe.thermalcorrener: 0.281280 hartree
zpe.thermalcorrenthalpy: 0.282225 hartree
zpe.thermalcorrgfe: 0.222091 hartree
zpe.sumelectzpe: -780.660030 hartree
zpe.sumelectthermal: -780.644351 hartree
zpe.sumelectthermalent: -780.643407 hartree
zpe.sumelectthermalfe: -780.703540 hartree
dipole: 3.8032 -5.3967 1.1321
dipole: 6.6985
quadrupole: -78.4948 -104.8537 -108.1784
quadrupole: 1.4966 -0.5353 4.9064
quadrupole: 18.6808 -7.6781 -11.0028 1.4966 -0.5353 4.9064
hfenergy: -780.9256315 hartree
pointgroup: C01 [X(C14H15N3O1)]
dipole: 1.1859281 2.160985 -0.9322641 debye
polarizability: 249.6349595|1.2066333|199.9322799|17.714915|-14.2034511|109.9457267 unknown
InChI: InChI=1S/C14H15N3O/c1-10-13(12-6-2-3-8-17(12)16-10)14(18)11-5-4-7-15-9-11/h2-3,6,8-9,15H,4-5,7H2,1H3
charge 0 multiplicity 1
33 atoms
O  1.323145 -1.871876 1.61347
N  4.188709 0.88925 0.395493
N  -2.560599 -0.461132 -0.323376
N  -2.516469 -1.856527 -0.378181
C  1.724281 0.747378 -1.118818
C  3.086881 0.99778 -1.815822
C  1.933835 -0.017312 0.187247
C  4.08409 1.676428 -0.849685
C  -0.434772 -0.99278 0.250147
C  0.972354 -0.993793 0.738383
C  -1.313377 0.110066 0.05974
C  3.157009 0.092289 0.831707
C  -1.229024 -2.162855 -0.006527
C  -1.269232 1.525937 0.231865
C  -0.800294 -3.599298 0.063302
C  -3.692043 0.283312 -0.581474
C  -2.410467 2.291369 -0.021438
C  -3.631783 1.664796 -0.445094
H  1.222697 1.722592 -0.956629
H  1.059514 0.173381 -1.790187
H  2.956164 1.639204 -2.706488
H  3.512242 0.034136 -2.153346
H  3.744025 2.708656 -0.622879
H  5.086104 1.749456 -1.311887
H  3.33174 -0.504407 1.73388
H  5.050003 0.93474 0.937498
H  -0.343315 1.984012 0.588499
H  -1.669724 -4.261752 -0.077002
H  -0.320711 -3.801329 1.035069
H  -0.052281 -3.829292 -0.718333
H  -4.579237 -0.282612 -0.869376
H  -2.381217 3.377068 0.11357
H  -4.526546 2.258715 -0.646926
