program: Gaussian 09
title: 000146808
version: EM64L-G09RevD.01
frameworkgroup: C1[X(C15H26O)]
method: RPBEPBE
basis: SDD
operation: Freq
keyword: #pfreq=noraman
keyword: PBEPBE/SDD
title: #p freq=noraman PBEPBE/SDD
converged: YES YES NO NO
title: Mulliken charges:
elementType: O C C C C C C C C C C C C C C C H H H H H H H H H H H H H H H H H H H H H H H H H H
charge: -0.479315 0.253120 -0.580541 -0.033516 -0.042589 0.502347 -0.466024 -0.646464 0.293550 -0.474326 -0.824236 -0.437174 -0.461967 -0.790653 -0.762963 -0.761870 0.202203 0.247085 0.202076 0.202687 0.205258 0.243385 0.200477 0.214989 0.196751 0.200030 0.224157 0.224172 0.215219 0.209590 0.206168 0.208743 0.220544 0.213108 0.221098 0.199645 0.214280 0.247699 0.246584 0.200279 0.214851 0.331541
chargesum: 0.00000
title: Mulliken charges with hydrogens summed into heavy atoms:
elementType: O C C C C C C C C C C C C C C C
charge: -0.147774 0.253120 -0.131252 0.168560 0.160097 0.502347 -0.017380 -0.230999 0.293550 -0.077545 -0.160688 -0.021416 -0.253223 -0.135903 -0.101338 -0.100156
polarizability: 1.91882845e+02 4.55551386e+00 1.55387089e+02 9.78837482e+00 2.43677435e+00 1.33638199e+02
1716.lowfreq: -9.9804 -0.0005 0.0003 0.0005 5.6405 19.9446 37.1090 59.8052 96.9541
frequency: 36.4509 59.7775 96.9503 131.2079 152.0385 175.5288 190.2692 206.8919 220.3675 235.3492 250.0467 252.4679 272.2704 283.8444 289.4565 313.6009 317.6952 333.9536 339.9295 370.9729 400.9791 427.4685 444.0468 454.4501 468.7714 507.9934 531.5923 549.9863 601.9705 649.6801 696.6040 756.9527 800.3140 809.5734 810.0618 840.0487 877.6259 890.4693 901.0096 907.9586 927.5145 932.7397 941.1360 956.8027 979.2648 982.3227 999.6584 1006.1958 1051.0452 1070.0899 1073.5643 1090.8043 1102.4033 1110.5380 1130.5140 1139.0694 1145.9809 1159.8889 1174.5806 1183.5946 1200.2327 1215.1890 1223.4270 1241.0675 1263.3840 1288.9796 1293.8053 1300.3624 1319.7020 1326.1200 1330.8462 1333.4920 1342.4324 1347.3212 1353.2115 1366.2560 1371.4241 1383.0640 1388.6586 1392.3048 1452.9829 1456.3711 1458.9573 1462.5540 1465.1951 1466.4158 1470.0216 1472.5509 1477.2345 1481.8109 1487.5091 1488.4500 1496.9081 1680.4556 2942.5442 2944.8498 2949.4156 2953.7492 2972.9767 2973.2217 2975.7157 2977.3492 2982.1424 2986.6265 2990.0563 2997.4891 3024.1221 3030.7208 3048.4690 3055.1449 3057.1025 3062.9176 3065.5197 3072.2896 3073.2186 3079.7863 3080.9584 3096.7184 3101.1298 3551.9299
redmass: 3.1726 3.3899 2.5880 2.8090 2.2724 2.2134 1.3084 1.0881 1.2787 1.7615 2.3945 1.6318 1.0604 2.2610 2.0923 2.1708 2.3756 2.6720 2.3687 2.1078 2.7881 2.8169 3.1513 3.3502 3.1793 2.2874 2.7303 2.5862 2.9686 3.1823 2.7342 3.4160 2.4294 1.6260 1.8831 1.4870 1.9429 2.0487 2.3888 1.4899 2.0299 1.7900 1.4851 1.6831 1.5204 1.7823 1.7030 1.9937 1.9062 1.6143 2.2466 1.5818 1.8020 1.8741 1.4141 1.8233 1.8518 2.6809 2.3442 2.4053 1.9138 2.0463 1.4193 1.4923 1.5175 1.3112 1.3185 1.2556 1.4568 1.5393 1.6052 1.6185 1.4618 1.5553 1.6608 1.4685 1.2264 1.2175 1.2078 1.2221 1.0680 1.0732 1.0770 1.0799 1.0517 1.0860 1.0755 1.0639 1.0653 1.0575 1.0578 1.0593 1.0539 7.7326 1.0658 1.0636 1.0819 1.0810 1.0380 1.0526 1.0461 1.0380 1.0381 1.0574 1.0605 1.0903 1.0927 1.1023 1.1021 1.1020 1.0990 1.0987 1.0976 1.0987 1.0983 1.0913 1.0961 1.0981 1.0975 1.0660
irintensity: 0.9736 0.7397 0.3817 0.0892 0.0958 0.1981 2.8954 0.4780 2.3650 1.1531 12.0138 3.3004 104.4280 2.2537 1.8703 0.8558 0.5808 4.6527 2.8503 1.2142 1.6850 1.4255 3.1631 1.4239 1.7346 1.9839 2.6069 4.9585 0.9730 4.9718 3.1479 9.8552 1.2350 11.1344 10.5238 7.6201 12.5100 2.6966 5.1990 0.8799 0.8065 3.5323 3.0314 3.6958 1.4432 20.2625 5.2313 5.6923 18.7576 2.7982 2.1267 60.0418 25.0810 12.3974 1.3831 8.9925 1.6653 13.2967 5.2522 8.4987 2.9937 5.2192 7.1258 4.9124 0.1801 4.7168 0.8966 1.6870 5.2785 29.6868 0.5834 8.6168 0.5831 6.3966 0.4026 8.8956 30.9642 16.6072 21.8524 18.4080 4.5509 6.4076 5.1508 5.3120 5.5859 6.4162 4.9173 10.6333 2.6412 8.3758 27.5682 17.6117 2.1549 3.1121 33.7910 49.2937 16.7177 17.9832 10.8702 11.3607 45.2285 38.8383 38.2127 44.8727 34.9400 59.7163 49.2217 47.4998 14.2131 37.3332 8.5053 54.9670 101.8674 20.2774 46.1756 32.3470 51.2282 27.1601 24.9612 4.6637
temp: 298.150 k
press: 1.00000 atm
elementType: 8 6 6 6 6 6 6 6 6 6 6 6 6 6 6 6 1 1 1 1 1 1 1 1 1 1 1 1 1 1 1 1 1 1 1 1 1 1 1 1 1 1
symmnumber: 1
zpe: 987871.4 jmol-1
zpe.correction: 0.376260 hartree
zpe.thermalcorrener: 0.393690 hartree
zpe.thermalcorrenthalpy: 0.394634 hartree
zpe.thermalcorrgfe: 0.333223 hartree
zpe.sumelectzpe: -661.121389 hartree
zpe.sumelectthermal: -661.103959 hartree
zpe.sumelectthermalent: -661.103015 hartree
zpe.sumelectthermalfe: -661.164426 hartree
dipole: 1.6144 0.7165 0.7151
dipole: 1.9055
quadrupole: -90.4879 -100.5480 -101.6898
quadrupole: 1.8038 0.8012 -1.0050
quadrupole: 7.0874 -2.9728 -4.1146 1.8038 0.8012 -1.0050
hfenergy: -661.4976496 hartree
pointgroup: C01 [X(C15H26O1)]
dipole: 0.6352051 0.2803061 0.28283 debye
polarizability: 191.8882936|4.5057854|155.3582975|9.7919972|2.5740395|133.661542 unknown
InChI: InChI=1S/C15H26O/c1-11-6-5-7-12-8-9-13(14(2,3)16)10-15(11,12)4/h7,11,13,16H,5-6,8-10H2,1-4H3
charge 0 multiplicity 1
42 atoms
O  2.889026 0.192946 -1.667605
C  -0.983918 0.319512 0.386935
C  0.436212 0.714452 -0.149376
C  1.607018 -0.162785 0.366442
C  -2.060834 1.141206 -0.418391
C  -1.196046 -1.189951 0.158398
C  1.316476 -1.646906 0.027356
C  -0.052855 -2.094097 0.597122
C  2.990571 0.319208 -0.183869
C  -3.475571 0.530211 -0.259989
C  -1.071145 0.626405 1.91416
C  -3.528728 -0.901592 -0.832106
C  -2.322298 -1.711758 -0.401746
C  -2.087275 2.650936 -0.086284
C  4.151979 -0.572574 0.317679
C  3.279898 1.796682 0.17791
H  0.614344 1.772483 0.117199
H  0.436908 0.652037 -1.254949
H  1.674089 -0.06517 1.472291
H  -1.78359 1.036827 -1.490415
H  2.10291 -2.307264 0.438396
H  1.327984 -1.763116 -1.072852
H  0.018228 -2.09899 1.706608
H  -0.264904 -3.137074 0.294296
H  -4.218415 1.174685 -0.769914
H  -3.755427 0.513454 0.812507
H  -0.771959 1.669632 2.125982
H  -2.098449 0.476231 2.291414
H  -0.408115 -0.034115 2.499747
H  -3.575939 -0.86452 -1.942121
H  -4.458076 -1.413649 -0.509453
H  -2.375113 -2.800229 -0.557784
H  -1.090138 3.120197 -0.165502
H  -2.758637 3.180465 -0.788047
H  -2.469356 2.833499 0.935482
H  5.125584 -0.160841 -0.011635
H  4.167378 -0.625686 1.422482
H  4.064093 -1.596096 -0.080987
H  2.570542 2.47351 -0.325219
H  4.302265 2.07985 -0.138452
H  3.208995 1.961817 1.269292
H  3.752285 0.476467 -2.063899
