program: Gaussian 09
title: 000146824
version: EM64L-G09RevD.01
frameworkgroup: C1[X(C17H14N2O5)]
method: RPBEPBE
basis: SDD
operation: Freq
keyword: #p
keyword: freq=noraman
keyword: PBEPBE/SDD
title: #p freq=noraman PBEPBE/SDD
converged: YES YES NO NO
title: Mulliken charges:
elementType: O O O O O N N C C C C C C C C C C C C C C C C C H H H H H H H H H H H H H H
charge: -0.273877 -0.442064 -0.253519 -0.202596 -0.445492 -0.018950 0.052909 0.402029 -0.120746 -0.139415 0.051232 -0.374744 -0.105255 0.076341 -0.705122 -0.352797 -0.210540 0.237210 -0.352381 -0.323219 -0.212080 0.223219 0.087622 -0.361684 0.272012 0.262844 0.228276 0.244504 0.233798 0.276230 0.238686 0.269885 0.279090 0.243417 0.229986 0.237515 0.381718 0.365960
chargesum: 0.00000
title: Mulliken charges with hydrogens summed into heavy atoms:
elementType: O O O O O N N C C C C C C C C C C C C C C C C C
charge: -0.273877 -0.060346 -0.253519 -0.202596 -0.079533 -0.018950 0.052909 0.402029 0.151266 -0.139415 0.051232 -0.111901 -0.105255 0.076341 0.001456 -0.076566 0.028146 0.237210 -0.082496 -0.044129 0.031336 0.223219 0.087622 0.105817
polarizability: 3.34498123e+02 -4.06047746e+01 2.41920388e+02 -2.70976667e+01 9.50203004e-01 1.28234559e+02
1716.lowfreq: -3.0404 -0.0005 -0.0004 -0.0001 2.5027 8.6095 17.1660 24.7011 37.4684
frequency: 17.0692 24.6740 37.4604 45.8018 53.4383 61.2205 98.6131 103.5261 119.8886 133.9163 151.8708 167.2161 218.9053 226.3362 259.7301 270.6805 283.3789 292.8854 311.8644 331.0071 340.6917 371.7999 385.0343 436.0653 442.1132 475.4957 498.6010 514.7142 524.8281 533.3255 552.1714 569.3850 585.5329 600.8495 608.0877 636.9984 653.9799 667.4186 681.4902 725.6892 732.6492 759.5678 789.8939 804.4191 828.7433 838.2385 846.6282 852.8205 890.1690 927.2454 937.7002 951.4531 972.7862 997.6206 1000.4274 1000.7488 1012.4495 1023.3189 1054.4584 1058.4904 1066.8085 1085.0501 1125.5580 1155.9678 1171.3600 1180.3836 1183.7291 1199.6157 1240.3001 1255.5591 1259.8431 1264.5998 1275.0808 1294.0951 1301.1940 1324.1173 1343.0665 1381.6185 1386.7971 1393.1121 1395.8536 1423.9767 1455.6470 1457.6290 1467.4301 1469.3325 1474.3965 1501.1217 1539.9038 1557.6184 1593.7967 1620.8279 1630.0129 1659.7153 2982.4723 2998.4709 3027.4803 3056.5248 3103.7637 3106.2002 3141.8437 3147.8520 3158.7803 3167.9865 3176.4892 3182.3464 3472.4372 3522.1146
redmass: 6.9212 6.2586 5.3427 9.2240 6.4443 3.5654 5.2659 4.4893 5.2905 5.7125 5.3132 4.2974 1.1184 4.3735 4.6509 3.9100 5.2667 5.4340 4.2460 1.5456 3.6216 6.1824 4.8566 5.1632 6.0341 5.5137 3.5488 4.5246 7.0958 3.5685 4.1146 3.1548 5.1707 1.8133 4.7711 3.1360 6.4307 6.1754 5.2770 6.3621 4.6959 2.0165 1.5985 4.4513 2.2284 5.9163 4.7554 3.9128 6.5638 7.1402 1.3816 1.4350 3.3894 1.3539 1.5321 1.8148 1.9479 5.5055 2.5210 2.0368 2.1170 1.8875 2.4984 1.3227 1.2723 2.9447 1.1238 1.8150 2.7455 1.3553 4.6012 2.5794 2.2666 1.3021 2.1436 1.6801 2.9024 2.8664 1.4116 2.6002 1.4594 4.0168 3.2527 1.0950 1.2961 1.0969 2.2280 8.4987 6.8370 7.4158 5.8023 7.1626 8.5830 9.0471 1.0590 1.0350 1.1023 1.0855 1.1008 1.1000 1.0873 1.0872 1.0921 1.0949 1.0988 1.0969 1.0652 1.0641
irintensity: 0.4673 2.2234 1.6970 2.4050 0.0640 13.5467 2.2140 2.7286 1.4642 0.2109 2.4199 1.5377 1.5159 3.1103 9.4017 5.8806 6.0439 26.2444 17.9260 61.4627 16.1560 10.7050 1.6737 3.3925 2.5772 4.5620 0.6561 7.3151 3.7837 18.1234 18.2323 9.3626 64.8698 67.2856 11.4643 40.1179 10.3410 12.8589 8.2847 15.8913 4.5329 89.9521 1.0730 8.0851 68.2924 37.1860 7.0969 3.5427 7.2292 121.9433 2.9094 1.5907 56.7059 6.3221 47.0181 68.1583 1.1065 240.4876 79.5750 45.7526 47.9906 163.8722 6.0257 12.0058 31.7515 266.7889 25.5041 10.6771 1.0471 140.8375 2.4976 7.6436 9.3098 15.4057 53.7981 12.3312 6.5282 14.2769 13.4077 3.8773 47.7308 30.7056 6.2099 17.5545 1.2270 9.8288 9.5672 3.0932 64.3688 8.3926 6.6236 34.8237 115.7897 173.9357 35.6256 17.7858 19.9170 0.2450 27.7137 12.8558 6.5567 2.8867 5.8599 9.5769 13.7750 6.4974 26.1270 39.9641
temp: 298.150 k
press: 1.00000 atm
elementType: 8 8 8 8 8 7 7 6 6 6 6 6 6 6 6 6 6 6 6 6 6 6 6 6 1 1 1 1 1 1 1 1 1 1 1 1 1 1
symmnumber: 1
zpe: 733750.3 jmol-1
zpe.correction: 0.279471 hartree
zpe.thermalcorrener: 0.300776 hartree
zpe.thermalcorrenthalpy: 0.301720 hartree
zpe.thermalcorrgfe: 0.226713 hartree
zpe.sumelectzpe: -1140.140485 hartree
zpe.sumelectthermal: -1140.119180 hartree
zpe.sumelectthermalent: -1140.118236 hartree
zpe.sumelectthermalfe: -1140.193242 hartree
dipole: 2.0790 -1.5689 3.5254
dipole: 4.3831
quadrupole: -138.9574 -125.3232 -144.7512
quadrupole: -12.6045 -16.1512 2.6819
quadrupole: -2.6135 11.0207 -8.4072 -12.6045 -16.1512 2.6819
hfenergy: -1140.4199554 hartree
pointgroup: C01 [X(C17H14N2O5)]
dipole: 0.6775688 -0.1432268 -1.579281 debye
polarizability: 339.8762247|35.6299658|212.5969575|-13.8893712|-49.1405537|152.1798884 unknown
InChI: InChI=1S/C17H14N2O5/c1-9(24-14(21)8-20)10-4-2-6-12-15(10)18-13-7-3-5-11(17(22)23)16(13)19-12/h2-7,9,20,22H,8H2,1H3
charge 0 multiplicity 1
38 atoms
O  -4.102834 0.296254 -0.393099
O  6.022564 -0.635111 -0.029404
O  -3.540865 1.753918 1.353562
O  4.504657 -1.406014 1.549332
O  -6.064459 1.604099 2.425135
N  0.112912 0.714892 -0.89908
N  1.856653 -1.233858 0.323369
C  -1.81637 -0.6478 -0.328186
C  -2.713792 0.401141 -0.970015
C  -0.38946 -0.421363 -0.323123
C  0.499842 -1.415869 0.277833
C  -2.310253 -1.828542 0.222615
C  2.354991 -0.077238 -0.208852
C  1.469883 0.898179 -0.85309
C  -2.876486 0.214933 -2.483672
C  -0.057785 -2.617086 0.831367
C  -1.43424 -2.812284 0.800687
C  3.781072 0.18983 -0.189604
C  2.023672 2.070203 -1.469739
C  4.273118 1.333721 -0.828511
C  3.3991 2.27479 -1.465109
C  -4.362739 1.016003 0.75811
C  4.729628 -0.702063 0.543434
C  -5.798828 0.819039 1.235667
H  -2.322025 1.40664 -0.739526
H  -3.390673 -2.006142 0.221659
H  -3.300622 -0.776552 -2.717462
H  -1.887652 0.302385 -2.965034
H  -3.539526 0.994001 -2.896865
H  0.631974 -3.342562 1.271921
H  -1.86776 -3.723746 1.225651
H  1.328333 2.776021 -1.934178
H  5.351919 1.511616 -0.825023
H  3.827354 3.163445 -1.939468
H  -5.959688 -0.257816 1.44289
H  -6.490261 1.114572 0.42307
H  6.630794 -1.205356 0.514063
H  -5.220149 2.07312 2.672076
