program: Gaussian 09
title: 000146827
version: EM64L-G09RevD.01
frameworkgroup: C1[X(C11H12Cl2O4)]
method: RPBEPBE
basis: SDD
operation: Freq
keyword: #p
keyword: freq=noraman
keyword: PBEPBE/SDD
title: #p freq=noraman PBEPBE/SDD
converged: YES YES NO NO
title: Mulliken charges:
elementType: Cl Cl O O O O C C C C C C C C C C C H H H H H H H H H H H H
charge: -0.004232 0.037155 -0.260643 -0.367874 -0.423448 -0.347511 -0.552150 0.684273 -0.363705 -0.000595 -0.676983 0.204118 0.633528 -0.694689 -0.598883 0.153676 -0.512946 0.249404 0.239609 0.218706 0.221159 0.214311 0.216739 0.222468 0.400061 0.230304 0.237222 0.244910 0.396017
chargesum: 0.00000
title: Mulliken charges with hydrogens summed into heavy atoms:
elementType: Cl Cl O O O O C C C C C C C C C C C
charge: -0.004232 0.037155 -0.260643 0.032187 -0.027431 -0.347511 -0.063137 0.684273 0.076160 -0.000595 -0.676983 0.204118 0.633528 -0.041171 -0.598883 0.153676 0.199490
polarizability: 2.13307188e+02 -5.43098706e+00 1.94047634e+02 5.23085188e+00 2.62951527e+00 8.20665195e+01
1716.lowfreq: -7.2659 -2.5290 -0.0022 -0.0014 0.0005 4.6574 35.8180 43.5640 54.6633
frequency: 35.8045 43.4820 54.6561 58.9841 74.9198 110.1818 117.5098 136.8588 140.5591 182.0107 191.0831 211.0672 232.1179 261.9021 276.5619 284.2821 322.0592 343.3736 351.0298 366.2825 386.7262 392.7675 426.4095 451.3503 579.7649 587.7126 610.7238 660.5175 669.6083 678.3953 721.7576 734.9102 749.6980 777.6658 823.8526 880.5440 886.0607 900.3151 903.1829 1019.5769 1045.3040 1058.0079 1062.9045 1089.5661 1107.0858 1110.8599 1151.7717 1158.9334 1231.1659 1266.1687 1281.3963 1288.6342 1311.9453 1332.8971 1357.3443 1370.5154 1389.2231 1397.6197 1420.4474 1445.0947 1461.8113 1468.1725 1470.5151 1476.3073 1477.8633 1488.4907 1528.3866 1550.5929 1622.1451 2850.0023 2975.1567 2983.3290 2993.0642 3025.9990 3042.8538 3074.3293 3076.2546 3083.5487 3105.9627 3138.6314 3498.8342
redmass: 4.6335 3.5398 3.4529 5.3039 5.9106 1.8437 8.8338 6.5324 1.0789 4.6268 17.1697 10.0798 1.1674 6.0382 4.1691 6.5167 9.3799 13.1784 6.9810 8.9610 2.9074 6.7569 6.7513 7.1246 4.0247 1.8021 3.5589 4.5269 4.8523 5.5255 8.4525 8.9405 1.2168 4.9159 9.9586 1.7052 1.5744 1.0918 5.5057 6.2565 4.3093 3.4137 4.7310 2.1190 1.2731 1.6710 1.4102 2.3454 1.4402 2.5989 1.3052 1.1536 6.5840 1.4246 5.0446 4.1412 1.2178 3.4010 3.1367 1.4184 1.0531 1.0544 1.0811 1.0438 1.0982 1.0992 4.6450 7.1572 3.5011 1.0709 1.0353 1.0305 1.0596 1.0673 1.0967 1.1007 1.0993 1.1055 1.0988 1.1024 1.0635
irintensity: 1.1245 3.1835 2.8087 1.0688 1.6823 0.0965 0.2843 0.2306 0.4318 5.8766 0.1302 0.1214 0.0247 1.9035 3.0479 2.5911 0.6474 0.6076 2.0856 0.6161 1.4214 4.6201 6.2987 2.3294 30.9606 91.8560 67.5217 29.0549 11.2927 2.8942 83.2970 14.3839 11.4239 14.4659 11.5967 9.7722 1.3980 155.4665 40.6541 14.4431 51.5015 8.8807 122.0760 38.3606 16.1096 15.8974 9.9804 373.4182 2.4111 162.8391 18.7646 7.7564 103.9842 3.8540 52.6246 250.1766 12.2658 63.7357 162.0528 16.3212 11.7248 17.2670 2.6444 10.1705 0.1639 19.0020 65.0854 84.3440 220.0156 351.1542 43.0019 57.1126 16.9593 16.2833 4.2571 43.6995 47.2536 22.8123 9.9958 17.9122 79.8733
temp: 298.150 k
press: 1.00000 atm
elementType: 17 17 8 8 8 8 6 6 6 6 6 6 6 6 6 6 6 1 1 1 1 1 1 1 1 1 1 1 1
symmnumber: 1
zpe: 555697.7 jmol-1
zpe.correction: 0.211654 hartree
zpe.thermalcorrener: 0.229546 hartree
zpe.thermalcorrenthalpy: 0.230490 hartree
zpe.thermalcorrgfe: 0.164442 hartree
zpe.sumelectzpe: -1646.100545 hartree
zpe.sumelectthermal: -1646.082653 hartree
zpe.sumelectthermalent: -1646.081708 hartree
zpe.sumelectthermalfe: -1646.147757 hartree
dipole: -3.0377 -0.7741 1.7192
dipole: 3.5753
quadrupole: -104.3850 -116.7069 -113.1037
quadrupole: -12.5133 5.4421 -5.2331
quadrupole: 7.0135 -5.3084 -1.7052 -12.5133 5.4421 -5.2331
hfenergy: -1646.3121988 hartree
pointgroup: C01 [X(C11H12Cl2O4)]
dipole: -1.139468 -0.5695535 0.596504 debye
polarizability: 213.9571252|-1.890295|192.0566181|10.6417314|9.0287111|83.4075986 unknown
InChI: InChI=1S/C11H12Cl2O4/c1-3-4-5-6(11(15)16)9(14)8(13)10(17-2)7(5)12/h14-15H,3-4H2,1-2H3
charge 0 multiplicity 1
29 atoms
Cl 0.57354 -2.982012 -0.641455
Cl 3.47544 1.623822 0.327045
O  2.988026 -1.346859 -0.23494
O  0.851339 2.938276 0.31529
O  -3.0072 1.344259 -0.206444
O  -1.625103 3.136772 0.099827
C  -1.948569 -1.204155 -0.67031
C  -0.650632 -0.460041 -0.398546
C  -2.610709 -1.74189 0.632424
C  -0.578299 0.959772 -0.142444
C  0.561493 -1.178263 -0.376456
C  0.706314 1.596814 0.09153
C  1.832778 -0.577903 -0.140597
C  -3.907306 -2.519737 0.328318
C  1.885336 0.810959 0.086282
C  -1.731043 1.869895 -0.082929
C  3.63919 -1.723401 1.043846
H  -2.670111 -0.55392 -1.185535
H  -1.732978 -2.064457 -1.328251
H  -1.893882 -2.398053 1.162325
H  -2.832894 -0.890523 1.302579
H  -4.645057 -1.875155 -0.185233
H  -3.70615 -3.389732 -0.324584
H  -4.373623 -2.895246 1.2573
H  -0.084167 3.370445 0.273679
H  2.966162 -2.375483 1.630035
H  3.916249 -0.825622 1.624192
H  4.542094 -2.276625 0.749068
H  -3.654341 2.098961 -0.134116
