program: Gaussian 09
title: 000146816
version: EM64L-G09RevD.01
frameworkgroup: C1[X(C11H23NO2S)]
method: RPBEPBE
basis: SDD
operation: Freq
keyword: #p
keyword: freq=noraman
keyword: PBEPBE/SDD
title: #p freq=noraman PBEPBE/SDD
converged: YES YES NO NO
title: Mulliken charges:
elementType: S O O N C C C C C C C C C C C H H H H H H H H H H H H H H H H H H H H H H H
charge: -0.042091 -0.255423 -0.249798 -0.566658 -0.377863 -0.371102 -0.377445 -0.352833 -0.392720 -0.356244 -0.286127 -0.695841 -0.206991 0.271957 -0.690713 0.196222 0.193503 0.190886 0.189554 0.196503 0.193000 0.187989 0.188960 0.209305 0.218573 0.194874 0.195394 0.231835 0.223399 0.209695 0.215710 0.210093 0.269641 0.291370 0.267830 0.284301 0.287377 0.103879
chargesum: 0.00000
title: Mulliken charges with hydrogens summed into heavy atoms:
elementType: S O O N C C C C C C C C C C C
charge: 0.061788 -0.255423 -0.249798 0.005020 0.011862 0.009337 0.012057 0.024116 0.035158 0.034024 0.169107 -0.060343 0.062650 0.271957 -0.131513
polarizability: 1.93820110e+02 7.82182788e+00 1.37326414e+02 -2.30262836e+00 3.88569668e+00 1.24270888e+02
1716.lowfreq: -5.6317 -4.1350 -0.0018 0.0003 0.0019 6.5273 8.2816 23.8633 31.7634
frequency: 2.5114 23.4572 31.5239 35.3945 49.1244 69.9803 87.5150 93.3458 97.3279 121.8195 135.2917 140.8667 144.3565 164.7527 179.4496 192.3189 232.7615 247.4811 268.3005 299.3363 316.1752 331.5870 374.4691 426.4577 473.9984 501.8453 626.0938 655.9429 703.6881 713.3964 720.8326 728.6763 751.2783 790.6060 808.5805 832.9600 857.1277 887.2340 901.5171 935.7386 936.9439 994.6717 1008.5630 1021.1692 1026.0856 1047.7521 1076.5212 1078.9190 1087.0909 1105.7097 1115.7318 1125.8805 1126.9909 1149.0479 1187.4697 1203.5549 1220.1059 1222.5770 1257.5797 1263.3233 1276.2587 1277.7363 1282.2758 1293.3089 1295.4956 1302.1666 1321.5239 1337.4422 1354.4700 1357.5144 1365.3614 1375.7539 1389.1459 1440.0742 1461.2415 1462.1896 1466.8010 1468.1542 1473.7067 1477.5974 1480.1127 1486.4718 1489.3852 1625.5423 1640.2782 2445.6388 2950.7112 2952.7361 2955.8520 2962.8760 2968.5291 2971.6644 2985.4371 2990.3865 2993.6985 3002.6919 3005.6062 3022.3443 3037.0280 3037.6660 3047.8781 3064.3780 3068.2814 3070.4935 3077.6645 3128.0187 3454.0937 3586.9190
redmass: 6.4026 4.1472 1.9281 3.2527 3.0884 2.2926 2.3049 3.2826 2.4658 1.4851 1.8385 2.1906 3.0671 3.5943 3.8420 4.0504 1.1222 1.9963 2.3509 1.9187 3.7474 4.5694 3.9972 3.3848 3.2539 3.9007 1.5577 2.5949 4.3668 4.8907 1.0627 1.0811 1.1087 1.1634 2.0299 2.2921 1.2095 2.1332 4.2346 1.2036 1.5268 4.4299 1.1143 3.1279 2.3690 3.1687 2.4306 2.2709 2.3549 1.8395 1.6381 3.0370 3.2359 1.4501 1.6656 1.5425 1.2902 1.3848 1.2525 1.2928 1.1168 1.3118 1.0641 1.1173 1.0982 1.3123 1.4431 1.4247 1.5994 1.6152 1.3398 1.5344 1.2179 1.0927 1.0734 1.0748 1.0684 1.0823 1.0787 1.0429 1.0800 1.0863 1.0960 5.9136 1.1721 1.0386 1.0590 1.0589 1.0593 1.0592 1.0587 1.0365 1.0969 1.0606 1.0985 1.0571 1.1017 1.1041 1.1043 1.0582 1.1043 1.0851 1.1007 1.0993 1.1081 1.1086 1.0451 1.0979
irintensity: 1.4152 1.6852 0.0053 0.0269 1.3780 0.8123 0.1610 1.2573 0.0466 18.9816 2.9692 0.2641 0.4608 0.4601 0.2487 1.4460 0.0043 27.6872 14.2796 50.0828 18.2465 8.4717 1.7678 4.7151 0.9030 2.1105 234.4528 73.4251 22.5741 8.8767 14.5117 0.1405 4.2250 0.1673 8.2307 4.9239 0.4213 0.3506 28.1505 1.1405 20.3968 0.4702 0.0500 3.4964 44.1777 2.2358 0.3347 8.4704 49.0360 50.2981 16.4476 194.5577 76.2153 3.0091 0.0127 14.6432 8.4703 0.4312 0.0754 0.5663 3.5109 35.5868 0.5918 0.1197 0.0899 0.1728 23.2558 1.3030 1.7717 0.2430 4.3731 0.9100 11.4311 15.9866 0.0378 0.0335 0.3813 0.0496 2.7841 12.3015 0.5446 2.3694 33.7226 186.5218 25.1028 31.2321 0.0260 1.8484 0.2269 20.4698 150.3954 36.5863 0.1120 20.0532 0.9497 35.9228 1.6727 0.0698 77.7288 13.7250 48.6585 9.2777 92.1498 54.5942 71.8849 9.4467 2.8492 6.1688
temp: 298.150 k
press: 1.00000 atm
elementType: 16 8 8 7 6 6 6 6 6 6 6 6 6 6 6 1 1 1 1 1 1 1 1 1 1 1 1 1 1 1 1 1 1 1 1 1 1 1
symmnumber: 1
zpe: 856474.8 jmol-1
zpe.correction: 0.326214 hartree
zpe.thermalcorrener: 0.346647 hartree
zpe.thermalcorrenthalpy: 0.347591 hartree
zpe.thermalcorrgfe: 0.271175 hartree
zpe.sumelectzpe: -1034.977361 hartree
zpe.sumelectthermal: -1034.956928 hartree
zpe.sumelectthermalent: -1034.955984 hartree
zpe.sumelectthermalfe: -1035.032400 hartree
dipole: 1.1022 -0.9404 -0.5258
dipole: 1.5413
quadrupole: -98.5797 -98.6101 -104.5058
quadrupole: 0.3636 0.7201 6.6852
quadrupole: 1.9855 1.9551 -3.9406 0.3636 0.7201 6.6852
hfenergy: -1035.3035745 hartree
pointgroup: C01 [X(C11H23N1O2S1)]
dipole: 0.4098128 -0.2752214 -0.3521722 debye
polarizability: 194.5091253|5.1433804|131.6055837|-0.4994968|7.2377458|129.3027036 unknown
InChI: InChI=1S/C11H23NO2S/c1-2-3-4-5-6-7-8-14-11(13)10(12)9-15/h10,15H,2-9,12H2,1H3
charge 0 multiplicity 1
38 atoms
S  -4.27008 2.432507 1.202113
O  -2.141595 0.024859 -0.355187
O  -3.524065 -1.32632 0.95402
N  -5.432751 -0.671654 -1.291514
C  2.86395 0.202305 -0.327995
C  4.184267 -0.340556 0.263386
C  1.60693 -0.457427 0.282633
C  5.442852 0.316283 -0.347171
C  0.292161 0.091148 -0.320332
C  6.764027 -0.228775 0.242011
C  -0.934744 -0.578133 0.296838
C  8.016555 0.432196 -0.373166
C  -4.538912 0.291388 -0.622456
C  -3.375329 -0.420017 0.098476
C  -5.369251 1.100119 0.39637
H  2.815059 1.299798 -0.170191
H  2.862666 0.045746 -1.426883
H  4.186138 -0.18338 1.362418
H  4.231979 -1.438739 0.106743
H  1.607926 -0.297599 1.380899
H  1.658845 -1.555311 0.126772
H  5.442098 0.161134 -1.446572
H  5.398457 1.414326 -0.18898
H  0.2848 -0.072002 -1.415438
H  0.229194 1.183842 -0.156438
H  6.8075 -1.325858 0.083862
H  6.763981 -0.073365 1.340326
H  -1.008692 -0.400831 1.385506
H  -0.953209 -1.66994 0.120916
H  8.055364 0.266413 -1.466495
H  8.9469 0.024708 0.063621
H  8.012686 1.525201 -0.200769
H  -4.118861 0.973043 -1.381163
H  -6.206533 1.580607 -0.130204
H  -5.743142 0.429688 1.188373
H  -5.105724 -0.98753 -2.209026
H  -5.711691 -1.450979 -0.684506
H  -5.113455 2.686703 2.270202
