program: Gaussian 09
title: 000146813
version: EM64L-G09RevD.01
frameworkgroup: C1[X(C12H16N4O4)]
method: RPBEPBE
basis: SDD
operation: Freq
keyword: #p
keyword: freq=noraman
keyword: PBEPBE/SDD
title: #p freq=noraman PBEPBE/SDD
converged: YES YES NO NO
title: Mulliken charges:
elementType: O O O O N N N N C C C C C C C C C C C C H H H H H H H H H H H H H H H H
charge: -0.206986 -0.210252 -0.206995 -0.210243 -0.151944 -0.151859 -0.350850 -0.350831 -0.103071 -0.103201 -0.497475 -0.497435 -0.412972 -0.426675 -0.412928 -0.426653 0.135526 0.149558 0.135459 0.149539 0.253565 0.253551 0.243988 0.228272 0.243997 0.228237 0.220516 0.264729 0.278232 0.227405 0.220515 0.264762 0.278211 0.227389 0.358457 0.358464
chargesum: 0.00000
title: Mulliken charges with hydrogens summed into heavy atoms:
elementType: O O O O N N N N C C C C C C C C C C C C
charge: -0.206986 -0.210252 -0.206995 -0.210243 -0.151944 -0.151859 0.007607 0.007633 0.150494 0.150349 -0.025215 -0.025201 0.072273 0.078962 0.072349 0.078948 0.135526 0.149558 0.135459 0.149539
polarizability: 2.01907315e+02 -7.95567691e-03 1.68366926e+02 -9.31956002e+00 -6.86907712e-03 1.21543849e+02
1716.lowfreq: -12.4655 -2.7053 -2.4097 0.0005 0.0009 0.0012 23.7609 32.2427 48.0978
frequency: 23.7599 32.2062 48.0963 78.1363 91.8807 100.0150 117.4720 126.6276 146.3198 147.2437 155.1212 215.1854 256.8853 276.5416 289.6633 342.5311 359.6471 379.2965 398.4516 422.4275 442.6615 463.0090 501.1492 544.3618 544.6074 551.7689 553.6548 577.2474 598.4836 600.1202 634.9373 679.6371 800.3339 801.7031 801.8422 804.7257 862.2442 876.8991 887.3420 905.4141 909.1179 934.3560 935.2830 964.8326 969.5324 972.2009 1019.2032 1029.3030 1030.2853 1084.1957 1097.7345 1126.1228 1147.7250 1169.0817 1170.8564 1198.5610 1201.1760 1202.4552 1224.1981 1234.9931 1241.6669 1247.6944 1252.6238 1253.2447 1282.0511 1285.3432 1305.4122 1313.4355 1320.0789 1321.1607 1321.3607 1339.3236 1363.5961 1373.3527 1373.4271 1375.1220 1437.2445 1449.7586 1450.0279 1454.4410 1458.5855 1465.1443 1648.5211 1650.9565 1651.2436 1653.2376 2823.8773 2825.0214 2837.1636 2837.8511 2876.2647 2887.8979 3027.8453 3035.0956 3080.8786 3081.4872 3083.4915 3084.8835 3098.3164 3117.2248 3486.6684 3486.7187
redmass: 9.3196 7.8680 6.1185 4.3745 5.4363 4.0000 2.7254 2.4546 8.0952 7.5324 3.0804 5.9224 2.4479 2.3262 5.4569 5.3609 6.1664 6.4575 3.8762 4.2657 5.1201 3.8634 3.0193 3.3564 2.8106 4.4794 4.6484 3.4377 3.6661 3.6790 3.4139 3.8804 2.9351 1.3301 1.3020 1.3147 3.7107 4.4770 4.4242 3.2302 3.1554 2.5754 1.7659 1.9148 1.8460 2.4935 2.2833 2.7282 3.0124 3.1238 1.7417 2.6280 2.2651 1.3593 1.3308 2.3466 2.5485 1.3503 1.2855 1.6106 1.3224 1.4769 1.2447 1.2520 2.9091 3.0048 1.4989 1.5877 3.7420 1.9487 2.4383 1.8574 1.6532 1.8273 1.8374 1.5390 1.0915 1.0784 1.0845 1.1013 1.0918 1.1272 7.3196 5.7049 7.8578 11.1134 1.0711 1.0707 1.0703 1.0702 1.0820 1.0834 1.0566 1.0626 1.0851 1.0854 1.0877 1.0869 1.1082 1.1076 1.0763 1.0763
irintensity: 0.3134 1.6734 1.7802 0.9543 0.0897 0.7996 0.0000 0.7999 11.9288 5.6230 0.0021 0.1838 4.5842 3.9388 3.3121 2.9727 35.2997 2.4162 20.4533 1.4028 6.5771 13.3083 1.9174 0.8039 11.9367 16.6116 9.2040 7.7251 6.3280 5.8649 0.4311 0.0841 1.8620 120.5417 80.2181 51.9942 4.2603 0.0115 9.1327 0.0426 4.2050 24.0556 14.2093 0.7909 2.9839 1.7024 8.5534 0.7937 0.5393 0.2044 1.5609 158.1075 11.2393 58.0545 51.3167 2.7860 10.7557 0.0357 6.6910 13.5006 2.0549 4.6578 0.0218 9.0375 260.0354 268.1656 19.6088 26.7614 177.3609 0.7648 30.4692 34.9805 13.2834 8.1690 7.8362 12.0363 7.9026 0.1105 1.8931 27.3321 6.0153 5.5559 182.9357 542.0339 506.2213 2.8261 11.7817 82.4854 133.2826 16.3379 4.8043 142.0034 35.1445 19.9963 8.6175 8.1517 6.0202 0.3278 9.1051 33.3584 72.6416 11.6056
temp: 298.150 k
press: 1.00000 atm
elementType: 8 8 8 8 7 7 7 7 6 6 6 6 6 6 6 6 6 6 6 6 1 1 1 1 1 1 1 1 1 1 1 1 1 1 1 1
symmnumber: 1
zpe: 741802.0 jmol-1
zpe.correction: 0.282537 hartree
zpe.thermalcorrener: 0.300713 hartree
zpe.thermalcorrenthalpy: 0.301657 hartree
zpe.thermalcorrgfe: 0.234638 hartree
zpe.sumelectzpe: -985.267642 hartree
zpe.sumelectthermal: -985.249467 hartree
zpe.sumelectthermalent: -985.248523 hartree
zpe.sumelectthermalfe: -985.315541 hartree
dipole: -0.0009 2.7220 0.0008
dipole: 2.7220
quadrupole: -154.2201 -129.8398 -119.0250
quadrupole: 0.0030 -1.5289 0.0067
quadrupole: -19.8585 4.5219 15.3366 0.0030 -1.5289 0.0067
hfenergy: -985.5501793 hartree
pointgroup: C01 [X(C12H16N4O4)]
dipole: -0.0011425 -1.0709293 0.0026362 debye
polarizability: 200.049154|0.0273376|168.3664832|15.2554418|-0.1429723|123.4024526 unknown
InChI: InChI=1S/C12H16N4O4/c17-9-3-15(4-10(18)13-9)7-1-2-8(7)16-5-11(19)14-12(20)6-16/h7-8,13-14H,1-6H2
charge 0 multiplicity 1
36 atoms
O  3.073974 2.790618 -1.219556
O  5.369709 -0.566878 1.021475
O  -3.0706 2.802935 1.198585
O  -5.372165 -0.565035 -1.020634
N  1.827168 -0.316203 0.199349
N  -1.828974 -0.314683 -0.201421
N  4.189386 1.058042 -0.146199
N  -4.189011 1.065464 0.136348
C  0.569036 -1.011592 0.544082
C  -0.571833 -1.013546 -0.542845
C  0.661558 -2.572166 0.416769
C  -0.666381 -2.573326 -0.407852
C  1.711077 1.135495 -0.023058
C  2.918129 -0.63849 1.14206
C  -1.710586 1.138161 0.01231
C  -2.920759 -0.640896 -1.141857
C  3.01891 1.740434 -0.531653
C  4.261997 -0.082557 0.679433
C  -3.017373 1.748383 0.517249
C  -4.263616 -0.080177 -0.682088
H  0.157044 -0.699317 1.534887
H  -0.159664 -0.706708 -1.535273
H  0.657662 -3.149681 1.353921
H  1.531819 -2.862436 -0.195043
H  -0.663313 -3.15539 -1.342186
H  -1.536959 -2.859532 0.205414
H  1.419252 1.708107 0.897931
H  0.950792 1.342546 -0.792021
H  3.031829 -1.730427 1.230146
H  2.731685 -0.245653 2.176707
H  -1.41772 1.704717 -0.912094
H  -0.950002 1.348655 0.780067
H  -3.036173 -1.733149 -1.223426
H  -2.734069 -0.254517 -2.178895
H  5.081831 1.450199 -0.472538
H  -5.080757 1.461006 0.460507
