program: Gaussian 09
title: 000146781
version: EM64L-G09RevD.01
frameworkgroup: C1[X(C8H10ClNO)]
method: RPBEPBE
basis: SDD
operation: Freq
keyword: #p
keyword: freq=noraman
keyword: PBEPBE/SDD
title: #p freq=noraman PBEPBE/SDD
converged: YES YES NO NO
title: Mulliken charges:
elementType: Cl O N C C C C C C C C H H H H H H H H H H
charge: -0.084594 -0.482686 -0.640303 -0.155728 0.528506 -0.451828 -0.328257 -0.377452 -0.232948 -0.226402 -0.229429 0.223806 0.238763 0.237784 0.293217 0.253679 0.229905 0.232556 0.372753 0.305030 0.293630
chargesum: 0.00000
title: Mulliken charges with hydrogens summed into heavy atoms:
elementType: Cl O N C C C C C C C C
charge: -0.084594 -0.109934 -0.041643 0.068078 0.528506 0.024719 -0.328257 -0.084235 0.020731 0.003502 0.003127
polarizability: 1.30551513e+02 7.95468839e+00 1.18026388e+02 -6.39610883e+00 -2.00917680e+00 5.82072913e+01
1716.lowfreq: -0.0023 0.0005 0.0014 7.1776 11.0246 15.3291 63.5944 89.9231 103.5138
frequency: 63.5433 89.8997 103.4866 159.7942 188.8986 262.5907 280.1011 287.0911 339.3034 393.0737 412.9375 454.1238 529.0342 550.5760 612.9231 676.9297 710.6802 722.4110 761.8235 792.0889 815.1753 875.0989 890.8201 923.3260 959.6294 997.7597 1007.9272 1035.6521 1044.1409 1062.8724 1117.9192 1132.2681 1167.4957 1205.4440 1247.1032 1279.1964 1284.8900 1315.7255 1350.0216 1378.6712 1401.4256 1424.7243 1459.6993 1465.5080 1572.6915 1607.2049 1640.8210 2936.7911 2991.6886 3069.4685 3134.5248 3152.2582 3168.5685 3175.7447 3200.5200 3465.5201 3589.3987
redmass: 4.8882 2.3542 4.1315 5.4800 5.7607 3.9178 1.8852 2.3264 3.4939 8.1728 4.6576 3.5277 4.2296 2.7381 5.5741 6.1801 1.2567 4.2765 1.2253 1.1260 3.4986 1.3615 2.8143 1.6551 1.3603 1.3498 5.9450 2.0543 4.1066 3.2914 1.6483 1.4169 1.0619 2.1547 1.4701 1.2641 1.1493 1.2081 1.2589 5.6863 1.5299 2.1899 2.2329 1.1822 6.3216 7.3383 1.0912 1.0830 1.0613 1.1032 1.0860 1.0914 1.0940 1.0993 1.0630 1.0464 1.0972
irintensity: 8.5732 2.1282 3.3443 2.5375 0.4177 1.8995 10.2648 7.5190 3.6841 7.7857 8.5079 6.1936 1.5484 9.1060 12.5870 39.5140 114.8532 5.0082 74.9603 191.6989 14.9297 2.9441 36.4755 3.9857 2.7406 2.6070 49.1713 5.4755 16.1750 46.6773 5.3647 22.6971 1.9984 20.0135 14.9408 7.7437 1.4650 16.2866 4.3267 17.2214 68.5582 42.2816 20.7682 12.2979 14.2355 0.5654 39.8086 33.0171 29.8109 21.0810 4.4558 13.9286 2.7391 19.0580 176.7524 0.9382 7.7310
temp: 298.150 k
press: 1.00000 atm
elementType: 17 8 7 6 6 6 6 6 6 6 6 1 1 1 1 1 1 1 1 1 1
symmnumber: 1
zpe: 436272.1 jmol-1
zpe.correction: 0.166167 hartree
zpe.thermalcorrener: 0.176771 hartree
zpe.thermalcorrenthalpy: 0.177715 hartree
zpe.thermalcorrgfe: 0.129491 hartree
zpe.sumelectzpe: -900.050632 hartree
zpe.sumelectthermal: -900.040029 hartree
zpe.sumelectthermalent: -900.039084 hartree
zpe.sumelectthermalfe: -900.087309 hartree
dipole: 1.5652 0.4888 2.5535
dipole: 3.0347
quadrupole: -53.3079 -73.7691 -75.3618
quadrupole: 5.7505 3.9996 -3.3959
quadrupole: 14.1717 -6.2895 -7.8822 5.7505 3.9996 -3.3959
hfenergy: -900.2167996 hartree
pointgroup: C01 [X(C8H10Cl1N1O1)]
dipole: 0.6273283 0.1444652 1.0055313 debye
dipolederiv: -0.2498666 -0.2006517 0.0260054 -0.1865564 -0.7269073 0.0579209 0.0125724 0.0544707 -0.0966354 -0.7055499 0.0871856 0.0097002 0.2161017 -0.5846521 -0.0756385 0.0853074 -0.1208671 -0.634585 -0.8174244 0.0717777 -0.0345315 0.0719112 -0.4321301 -0.2259477 -0.0704609 -0.2461773 -0.4298869 0.2739233 -0.1708484 -0.0607543 -0.3022592 0.4242118 -0.0263599 -0.262142 0.0176458 0.341674 0.2219123 -0.0402094 0.0254653 0.0306056 -0.3000475 -0.0031832 -0.0352134 0.0127543 -0.0452726 0.5894038 -0.0840294 -0.0271816 0.0931939 0.1797076 0.0053896 0.2240771 -0.007145 0.0881421 0.1807645 0.3137187 -0.0658154 0.2835366 0.99856 -0.076828 -0.0428905 -0.0761993 -0.0594449 -0.1083651 0.0332827 -0.0419308 -0.0886041 0.0203455 0.0058796 -0.0508164 0.0199613 -0.1169194 -0.0975231 -0.1087135 -0.0049605 -0.1241657 -0.1909887 0.0263081 0.0002708 0.02096 -0.1077122 -0.0286559 0.065987 -0.0233118 0.062045 0.0954249 -0.0058885 -0.0108343 -0.0065115 -0.1522716 0.0502636 -0.0270115 -0.0551125 0.0367599 0.0151883 -0.0055886 -0.0436862 0.0075489 -0.154298 -0.029485 -0.0034059 0.0351996 -0.0145021 -0.1097556 0.0883521 0.018841 0.0787877 -0.0490004 0.026917 -0.0236397 0.0354567 -0.0062042 0.007134 0.1214581 0.0529461 0.0623846 -0.0316796 0.0049189 0.0502748 0.0292491 0.0429629 -0.1171295 -0.1036744 0.0204085 -0.0557524 0.0495142 0.1279566 0.0442529 0.0146572 0.0541982 0.0179438 -0.0025537 -0.0002797 -0.0106403 0.1504676 0.0488842 0.0604679 0.0207851 0.0818006 -0.0067761 -0.0156157 0.0258627 -0.013829 0.1607381 0.0434714 -0.0754653 0.0204379 -0.0899845 -0.088539 0.0122971 0.0250398 0.009221 0.1558766 -0.1132865 -0.0277918 0.0537981 -0.0250754 0.0719854 0.0049978 0.0529033 0.0057617 0.1524837 0.3562247 0.0625243 0.0735999 0.0211544 0.3207356 0.064397 0.0809189 0.0816598 0.4185187 0.0925516 -0.009359 -0.0424174 -0.0725463 0.2815535 0.0345383 -0.0897505 0.0791463 0.110547 0.1329645 -0.0183461 0.0116614 -0.084372 0.1241355 0.1197396 0.006926 0.0868199 0.249744 unknown
polarizability: 131.1345856|7.5494504|117.4388031|-6.6058219|-0.4660632|58.2118035 unknown
InChI: InChI=1S/C8H10ClNO/c9-7-4-2-1-3-6(7)8(11)5-10/h1-4,8,11H,5,10H2
charge 0 multiplicity 1
21 atoms
Cl -0.290451 2.67752 -0.188278
O  1.920956 -1.253229 -1.000339
N  3.622098 0.059755 0.549567
C  1.386892 -0.000219 -0.483725
C  -0.102458 -0.141606 -0.210312
C  2.189911 0.347329 0.817553
C  -0.960411 0.967312 -0.034872
C  -0.687178 -1.42994 -0.104558
C  -2.33373 0.839327 0.245002
C  -2.060958 -1.590591 0.17658
C  -2.887115 -0.456871 0.354813
H  1.543234 0.816989 -1.222544
H  1.853504 -0.327906 1.624245
H  1.9849 1.390141 1.127626
H  -0.029139 -2.28693 -0.275414
H  -2.955082 1.73072 0.370229
H  -2.488244 -2.596725 0.247445
H  -3.954931 -0.571552 0.569889
H  2.885807 -1.21779 -0.694514
H  4.148265 -0.285474 1.356828
H  4.12153 0.814942 0.067479
