program: Gaussian 09
title: 000146812
version: EM64L-G09RevD.01
frameworkgroup: C1[X(C15H15N5)]
method: RPBEPBE
basis: SDD
operation: Freq
keyword: #pfreq=noraman
keyword: PBEPBE/SDD
title: #p freq=noraman PBEPBE/SDD
converged: YES YES NO NO
title: Mulliken charges:
elementType: N N N N N C C C C C C C C C C C C C C C H H H H H H H H H H H H H H H
charge: -0.148413 -0.415998 -0.009989 -0.144584 -0.104489 0.151199 0.216550 0.414476 0.110639 -0.387947 -0.315652 -0.331456 -0.302809 0.152000 -0.443153 -0.202877 -0.309892 -0.363585 -0.644805 -0.645635 0.241296 0.238393 0.240848 0.270404 0.336587 0.267190 0.222545 0.259462 0.246972 0.220348 0.240371 0.240489 0.220541 0.240429 0.240544
chargesum: 0.00000
title: Mulliken charges with hydrogens summed into heavy atoms:
elementType: N N N N N C C C C C C C C C C C C C C C
charge: -0.148413 -0.079411 -0.009989 -0.144584 -0.104489 0.151199 0.216550 0.414476 0.110639 -0.146651 -0.077259 -0.090608 -0.032405 0.152000 -0.175963 0.019668 -0.050430 -0.116613 0.056403 0.055879
polarizability: 5.56724179e+02 -1.56369688e+01 2.08992310e+02 2.08166197e-01 4.67852491e-02 8.62440264e+01
1716.lowfreq: -4.0086 -0.0008 -0.0006 -0.0002 4.8034 10.4321 19.6840 34.7908 48.2814
frequency: 19.4126 34.7469 48.2695 68.6517 87.1256 117.2153 149.9174 155.9430 189.8473 190.9371 200.5966 246.2149 251.5546 259.7518 300.8915 376.4858 390.6582 409.4626 434.9097 467.4982 495.9206 516.2145 518.6314 545.9907 570.2251 576.3535 618.4027 622.8382 632.4668 666.9448 685.0862 741.0832 748.1450 763.9317 796.3364 804.7942 831.8992 841.0687 846.6807 888.6591 915.9446 920.9755 938.8132 963.3432 976.9744 979.1654 987.1196 1025.4324 1032.8923 1055.4521 1056.9976 1102.8630 1110.4102 1120.9371 1157.5286 1164.0588 1177.7432 1197.1057 1215.4624 1245.7222 1255.0189 1270.7270 1295.3795 1307.5003 1331.7457 1338.8680 1364.0207 1380.5384 1384.6082 1426.8715 1430.2216 1444.7880 1455.1081 1459.1851 1464.4356 1477.8679 1482.0337 1491.1261 1499.2007 1520.5998 1550.6217 1583.8871 1623.6099 1626.7594 2949.2958 2956.0537 3018.3083 3021.5121 3102.2088 3112.0064 3133.3412 3146.8518 3149.2750 3155.4033 3168.8947 3169.9870 3172.8688 3225.2095 3635.7463
redmass: 3.6170 4.6763 5.5287 2.2626 4.6352 1.5223 5.0131 2.6939 5.6083 1.2480 4.5219 4.4503 3.8366 3.8840 4.4126 4.2540 4.9862 4.7213 3.4042 3.9250 4.9325 2.6981 4.5627 3.0577 5.9914 4.0508 2.1111 6.1362 6.9088 1.7729 5.4255 3.3846 2.4780 6.4063 1.4944 1.2625 1.7634 1.6465 5.7145 7.6561 4.3202 1.4103 3.0434 1.3567 1.3358 1.3400 2.8708 3.4310 4.6541 1.5269 1.9443 1.2385 1.3279 1.3610 1.4049 1.6719 1.2157 1.3909 2.2281 2.7878 2.9413 3.1801 2.9549 1.5277 4.0742 3.1530 3.2013 4.8586 4.0053 3.2194 1.1890 3.4102 1.6016 2.0362 1.0403 1.0456 3.5611 1.1390 1.3509 1.9716 6.4160 6.5183 6.9361 7.3387 1.0367 1.0391 1.0998 1.1027 1.0966 1.0946 1.0863 1.0878 1.0864 1.0933 1.0954 1.0963 1.0961 1.0976 1.0819
irintensity: 0.0572 2.1894 1.2452 0.0147 0.4223 3.4593 0.9008 0.0203 1.2501 0.1118 2.6337 1.3115 4.6747 4.6584 0.0670 2.9315 0.9987 17.9388 0.0623 2.0136 29.4551 16.9280 1.9246 0.6882 6.0000 2.0696 36.3181 7.0790 0.9501 68.1478 12.8631 6.2141 38.7337 0.5454 1.9689 1.9949 57.6183 91.5594 22.3922 0.8850 25.3775 0.0107 40.6880 1.6338 0.3123 2.5381 0.3068 1.7260 19.0883 32.0820 5.6627 0.0155 0.9756 4.2979 188.1471 26.5315 63.8595 3.7299 3.0785 15.6638 21.1839 17.0270 28.2247 27.7899 58.0568 419.0134 201.8880 18.8217 30.2243 34.6353 6.6865 16.5871 17.0608 11.2828 0.4465 23.6574 5.7734 0.8894 13.7376 232.2129 48.0566 4.5503 490.5013 166.4469 88.6574 201.2969 7.7158 68.3526 3.8795 48.6823 9.9684 5.6412 3.2644 17.2217 21.3454 20.6405 21.4110 6.4143 43.2655
temp: 298.150 k
press: 1.00000 atm
elementType: 7 7 7 7 7 6 6 6 6 6 6 6 6 6 6 6 6 6 6 6 1 1 1 1 1 1 1 1 1 1 1 1 1 1 1
symmnumber: 1
zpe: 723970.3 jmol-1
zpe.correction: 0.275746 hartree
zpe.thermalcorrener: 0.293131 hartree
zpe.thermalcorrenthalpy: 0.294075 hartree
zpe.thermalcorrgfe: 0.228821 hartree
zpe.sumelectzpe: -852.890977 hartree
zpe.sumelectthermal: -852.873592 hartree
zpe.sumelectthermalent: -852.872648 hartree
zpe.sumelectthermalfe: -852.937902 hartree
dipole: -7.2926 -0.4981 0.0172
dipole: 7.3097
quadrupole: -73.9111 -111.3356 -123.5730
quadrupole: -14.2049 0.1495 0.1446
quadrupole: 29.0288 -8.3957 -20.6331 -14.2049 0.1495 0.1446
hfenergy: -853.1667225 hartree
pointgroup: C01 [X(C15H15N5)]
dipole: -2.8538727 0.0951812 0.3417567 debye
polarizability: 556.3654342|-22.0943009|89.8478385|-3.2322452|-17.356269|205.7472427 unknown
InChI: InChI=1S/C15H15N5/c1-20(2)13-8-6-12(7-9-13)17-18-14-5-3-4-11-10-16-19-15(11)14/h3-10,19H,1-2H3
charge 0 multiplicity 1
35 atoms
N  -5.539449 0.22123 -0.192652
N  3.038198 0.067133 -2.099685
N  4.256803 0.102144 -2.784544
N  0.874067 -0.102632 -0.085582
N  0.012411 -0.212229 0.906388
C  3.198025 -0.126207 -0.74146
C  4.612812 -0.225746 -0.514811
C  -4.171423 0.119249 0.050727
C  2.236446 -0.223688 0.304674
C  5.089365 -0.430256 0.807762
C  -3.216599 0.25007 -1.017993
C  -3.667316 -0.119281 1.372861
C  2.746214 -0.42754 1.612082
C  -1.349222 -0.090721 0.541674
C  5.202791 -0.075423 -1.824272
C  4.14428 -0.527753 1.852224
C  -1.844158 0.14698 -0.776861
C  -2.289497 -0.219452 1.602539
C  -6.497365 0.080436 0.914009
C  -6.036758 0.467312 -1.554723
H  6.161719 -0.510041 1.014454
H  -3.561586 0.433116 -2.039536
H  -4.354535 -0.225359 2.216139
H  2.030214 -0.505491 2.43593
H  2.16398 0.178409 -2.606379
H  6.253494 -0.087421 -2.108309
H  4.492616 -0.684823 2.879223
H  -1.12379 0.247393 -1.594668
H  -1.901784 -0.400994 2.610699
H  -7.522613 0.185058 0.526993
H  -6.34428 0.857477 1.689475
H  -6.415776 -0.911549 1.40141
H  -7.136511 0.515417 -1.538977
H  -5.741193 -0.34211 -2.251629
H  -5.660082 1.426791 -1.961682
