program: Gaussian 09
title: 000146799
version: EM64L-G09RevD.01
frameworkgroup: C1[X(C16H10O6)]
method: RPBEPBE
basis: SDD
operation: Freq
keyword: #pfreq=noraman
keyword: PBEPBE/SDD
title: #p freq=noraman PBEPBE/SDD
converged: YES YES NO NO
title: Mulliken charges:
elementType: O O O O O O C C C C C C C C C C C C C C C C H H H H H H H H H H
charge: -0.221461 -0.229731 -0.175828 -0.174947 -0.408898 -0.240948 0.206430 0.266066 0.198045 0.098180 0.091780 -0.371429 0.126983 -0.432147 -0.369537 -0.517827 -0.366431 -0.240499 0.107724 0.104813 -0.500531 0.185984 0.267095 0.285229 0.316638 0.275152 0.255363 0.282590 0.246840 0.264169 0.289573 0.381559
chargesum: 0.00000
title: Mulliken charges with hydrogens summed into heavy atoms:
elementType: O O O O O O C C C C C C C C C C C C C C C C
charge: -0.221461 -0.229731 -0.175828 -0.174947 -0.027339 -0.240948 0.206430 0.266066 0.198045 0.098180 0.091780 -0.104334 0.126983 -0.146918 -0.052899 0.012688 -0.083841 0.006342 0.107724 0.104813 0.053212 0.185984
polarizability: 2.98241421e+02 1.28015062e+00 2.29384161e+02 1.86614623e+00 2.21854138e+00 8.33036814e+01
1716.lowfreq: -9.7279 -2.4531 -0.0004 0.0002 0.0011 1.9143 15.0989 21.7869 40.9601
frequency: 15.0893 21.7418 40.9574 51.8629 62.0984 70.8858 120.8873 130.4806 172.1004 172.6432 200.5211 201.0313 259.2855 285.9880 314.3268 332.8671 376.7195 394.4927 416.0775 443.1417 463.7286 467.5757 497.1390 506.8734 512.3633 559.6540 572.2575 578.1206 598.6703 639.6275 642.8796 650.3552 659.5223 708.9018 724.7739 746.6769 781.8233 791.5711 804.6515 833.2912 846.5661 876.2366 897.0339 916.3615 924.4716 977.2765 996.9489 1011.1634 1016.2216 1020.4131 1055.8614 1058.4752 1091.2437 1107.5482 1147.3304 1156.5333 1180.1311 1199.4845 1221.0829 1234.3483 1243.7709 1261.1506 1286.7749 1316.5524 1361.3896 1372.3986 1382.5453 1419.1507 1425.9730 1440.2486 1445.2624 1461.4173 1520.7701 1570.0633 1581.6610 1592.4149 1612.4182 1646.0421 1660.5065 1683.3977 2980.2619 3008.0408 3040.3911 3077.9791 3151.5100 3161.1628 3169.9272 3180.6299 3195.3353 3513.6795
redmass: 8.5499 8.1981 6.5203 7.5492 5.6101 5.5759 2.5233 13.4048 6.4030 4.8163 6.2722 5.4375 5.1246 7.7215 10.1637 7.2683 10.9607 10.0838 4.8100 5.8150 3.2779 4.7370 5.8627 2.7526 3.4275 6.1450 4.0412 5.2693 4.2625 3.5487 5.7228 1.7296 6.2080 3.9798 5.8335 6.4325 2.8657 5.3681 1.7671 7.7508 1.9929 1.5047 4.0411 5.1601 10.5635 1.3938 1.4740 2.9188 3.1417 1.3779 4.1978 2.9701 2.1058 2.2783 1.7999 1.5538 1.8462 1.4110 2.1292 1.5886 1.7042 1.3473 2.2113 1.7819 3.3035 2.2255 4.1440 3.0124 6.1192 1.1336 1.1680 2.0982 4.7548 6.3743 6.7396 7.3642 8.1783 12.5695 8.1620 12.7058 1.0628 1.0645 1.0952 1.0961 1.0886 1.0895 1.0955 1.0950 1.0954 1.0640
irintensity: 0.3224 1.6852 3.5411 0.9903 4.8691 0.6445 0.7290 0.3826 8.4104 1.7662 8.6347 3.2449 1.0929 2.1350 0.8440 9.5038 5.0405 10.1179 0.8437 9.6044 4.6488 24.8128 9.0483 5.1205 65.7741 12.5120 8.1559 33.1235 9.2914 5.1403 11.1350 97.2233 21.2284 1.1448 10.3726 17.0511 51.0172 1.0190 5.8142 1.7583 39.6011 21.3854 11.3838 41.0537 293.0789 0.1364 4.9979 7.3062 54.0686 2.4934 9.3188 470.8080 29.7116 7.5509 23.8095 8.2998 3.9342 17.7918 41.7298 43.1395 122.0648 51.0913 154.0554 108.7916 28.3472 61.6184 11.8990 23.0389 5.3688 2.7437 63.7023 12.7445 52.6795 23.9414 24.5968 122.0795 30.2698 259.0385 192.5174 332.1472 36.9605 27.0390 4.6418 5.8203 5.5085 1.3360 5.2495 3.6620 16.2755 31.9934
temp: 298.150 k
press: 1.00000 atm
elementType: 8 8 8 8 8 8 6 6 6 6 6 6 6 6 6 6 6 6 6 6 6 6 1 1 1 1 1 1 1 1 1 1
symmnumber: 1
zpe: 589287.7 jmol-1
zpe.correction: 0.224448 hartree
zpe.thermalcorrener: 0.242804 hartree
zpe.thermalcorrenthalpy: 0.243748 hartree
zpe.thermalcorrgfe: 0.174776 hartree
zpe.sumelectzpe: -1065.561108 hartree
zpe.sumelectthermal: -1065.542752 hartree
zpe.sumelectthermalent: -1065.541808 hartree
zpe.sumelectthermalfe: -1065.610780 hartree
dipole: -6.3168 2.6151 0.9704
dipole: 6.9052
quadrupole: -151.8077 -130.1323 -125.0989
quadrupole: 15.5193 -5.1514 -1.0506
quadrupole: -16.1281 5.5473 10.5807 15.5193 -5.1514 -1.0506
hfenergy: -1065.7855557 hartree
pointgroup: C01 [X(C16H10O6)]
dipole: -2.5816564 0.8459765 -0.0002322 debye
polarizability: 297.150217|9.7913044|210.8474879|3.1458469|-49.8160415|102.9315588 unknown
InChI: InChI=1S/C16H10O6/c17-12(6-7-13(18)19)8-4-5-11-14-9(8)2-1-3-10(14)15(20)22-16(11)21/h1-5,18H,6-7H2
charge 0 multiplicity 1
32 atoms
O  4.37756 -0.660037 0.441699
O  -2.49241 1.300745 -1.042938
O  3.540192 -2.64936 1.21158
O  5.274884 1.308834 -0.316036
O  -7.02637 -0.331903 0.472953
O  -5.674624 -2.193108 0.162147
C  1.718603 0.294229 -0.105407
C  0.378201 0.773375 -0.383743
C  -0.747407 -0.096917 -0.078402
C  1.917229 -1.01411 0.44542
C  2.851967 1.130069 -0.384135
C  -0.495572 -1.372871 0.469116
C  -2.184165 0.296781 -0.333613
C  0.817351 -1.835792 0.725078
C  0.24224 2.093634 -0.934944
C  -3.295723 -0.567226 0.27702
C  2.674717 2.413291 -0.923116
C  1.364752 2.889154 -1.194559
C  3.282521 -1.530493 0.735797
C  4.233933 0.664414 -0.111519
C  -4.682822 0.07484 0.120421
C  -5.790485 -0.949715 0.253071
H  -1.329061 -2.041966 0.695405
H  0.994083 -2.832172 1.141404
H  -0.759441 2.45962 -1.163804
H  -3.306961 -1.557998 -0.222069
H  -3.078826 -0.770082 1.342191
H  3.558253 3.027387 -1.124459
H  1.229935 3.890592 -1.614972
H  -4.850159 0.888747 0.846303
H  -4.764199 0.550476 -0.876463
H  -7.740095 -1.025238 0.516671
