program: Gaussian 09
title: 000146775
version: EM64L-G09RevD.01
frameworkgroup: C1[X(C5H6N4O4)]
method: RPBEPBE
basis: SDD
operation: Freq
keyword: #pfreq=noraman
keyword: PBEPBE/SDD
title: #p freq=noraman PBEPBE/SDD
converged: YES YES NO NO
title: Mulliken charges:
elementType: O O O O N N N N C C C C C H H H H H H
charge: -0.314876 -0.360500 -0.209200 -0.183773 -0.080909 -0.026078 0.062184 -0.303552 -0.462854 -0.110058 0.156906 -0.352167 0.319144 0.257268 0.270632 0.304005 0.295953 0.351862 0.386013
chargesum: 0.00000
title: Mulliken charges with hydrogens summed into heavy atoms:
elementType: O O O O N N N N C C C C C
charge: -0.314876 0.025513 -0.209200 -0.183773 -0.080909 -0.026078 0.062184 0.048310 0.065047 0.193947 0.156906 -0.056214 0.319144
polarizability: 1.36850431e+02 1.01331614e+00 1.01884851e+02 5.55906479e+00 -9.41116462e+00 6.08255652e+01
1716.lowfreq: -6.6848 -2.6557 0.0005 0.0005 0.0006 4.6324 16.6423 35.5546 52.5053
frequency: 16.5327 35.5482 52.5036 91.7619 161.7969 172.1578 221.8328 243.6534 292.1695 328.2472 362.5769 401.9407 434.1507 476.4416 521.0478 585.7582 601.4159 613.8335 704.0363 722.6735 750.5728 778.5888 794.0355 891.2960 910.8226 944.7245 956.9328 985.3962 1020.7146 1045.9103 1132.3578 1162.3645 1219.3716 1250.3627 1306.1490 1334.8508 1344.2633 1355.3611 1370.1179 1394.8899 1436.7297 1446.1649 1489.7233 1510.0753 1581.9356 3029.1803 3107.9746 3242.1072 3273.1802 3276.9901 3606.1884
redmass: 7.2611 9.0480 10.4726 6.3008 7.5424 8.5540 9.1182 4.8231 6.7571 5.6201 3.0903 1.7550 3.1363 1.0750 5.6811 3.2830 5.4473 5.3675 5.3840 6.0110 11.8216 2.9363 1.7236 1.4117 2.9959 4.0354 5.2919 4.6658 3.9891 1.3434 1.6052 2.1942 4.3371 1.6783 1.8837 1.8591 5.0308 3.3296 3.7192 3.4810 4.4946 1.1975 4.3488 1.7488 5.0015 1.0617 1.1017 1.0963 1.1061 1.0640 1.0835
irintensity: 5.8239 4.6517 3.5155 5.8107 1.9209 0.2505 2.6620 18.4940 7.1852 6.9799 26.1742 21.5255 6.8386 286.7611 0.3652 3.0295 7.5462 1.2468 17.1574 12.8021 44.5905 23.5196 51.6351 1.9121 35.7822 16.6431 1.6051 5.5592 55.1660 38.6786 40.7134 10.9112 203.0713 65.3993 15.8518 50.2798 59.5952 81.4830 109.6330 41.1871 6.3460 18.5852 3.8643 48.9107 131.7607 12.2247 1.0748 4.7203 4.8666 24.7222 84.8969
temp: 298.150 k
press: 1.00000 atm
elementType: 8 8 8 8 7 7 7 7 6 6 6 6 6 1 1 1 1 1 1
symmnumber: 1
zpe: 334891.0 jmol-1
zpe.correction: 0.127553 hartree
zpe.thermalcorrener: 0.139595 hartree
zpe.thermalcorrenthalpy: 0.140539 hartree
zpe.thermalcorrgfe: 0.086625 hartree
zpe.sumelectzpe: -712.902410 hartree
zpe.sumelectthermal: -712.890368 hartree
zpe.sumelectthermalent: -712.889424 hartree
zpe.sumelectthermalfe: -712.943338 hartree
dipole: 5.1517 1.2143 2.1992
dipole: 5.7316
quadrupole: -97.1038 -73.5478 -71.5731
quadrupole: -11.3836 2.8480 -1.0057
quadrupole: -16.3622 7.1938 9.1684 -11.3836 2.8480 -1.0057
hfenergy: -713.0299631 hartree
pointgroup: C01 [X(C5H6N4O4)]
dipole: -2.0044742 -0.8967599 0.5126421 debye
dipolederiv: -0.5971355 -0.0918581 -0.152265 0.1918582 -0.7337145 -0.1428214 -0.0259005 -0.3546413 -0.6251016 -0.6259441 0.1680073 -0.0144704 0.0865272 -0.2677571 0.0620924 -0.2800625 0.2585883 -0.2874885 -0.7656652 0.0055547 0.2166867 -0.047469 -0.3900147 -0.1296629 0.2076927 -0.1457648 -0.4676451 -0.5084525 -0.1567946 -0.0301958 -0.1773085 -0.5533741 -0.2711741 -0.0231263 -0.2526386 -0.4542641 -0.6397735 -0.0865258 0.0828796 -0.2159585 -0.114936 0.0611952 -0.0308517 0.02918 -0.1227372 0.3348762 0.2102045 0.0045313 0.2742902 -0.220468 -0.1494793 -0.0051355 -0.1747756 -0.2905495 1.5459849 0.3854366 -0.1859155 0.5028212 0.8517776 0.429554 -0.1636888 0.4271982 0.7064809 -0.0966091 -0.0173708 0.2669827 0.0998552 -0.4917062 -0.1152091 0.4245841 -0.2791895 -0.1942668 0.4929254 -0.0149588 -0.1574096 -0.0379302 0.1603274 -0.0347743 -0.3008643 -0.0793055 0.1630375 0.0704902 -0.0088426 -0.05178 -0.0972661 -0.0367091 0.0877769 -0.1201053 0.1069424 0.031238 -0.5825135 -0.2320824 0.0057617 -0.1652879 0.0496998 0.0482279 0.175086 0.0870879 0.1138807 -0.1682309 0.0047228 -0.0450689 0.0494265 -0.0831967 0.0340407 0.0475551 0.0790673 -0.1009208 0.5661495 -0.1990159 0.0953648 -0.4199218 1.0094938 0.3856887 0.1276848 0.498021 0.5042686 0.0498434 0.0025659 -0.0260236 0.0388411 0.0414903 -0.0992645 0.0041244 -0.0425494 0.0573894 -0.0375333 0.0053611 0.0221845 -0.0289405 -0.0226227 0.0896669 0.0388789 0.0243777 0.07752 0.1217261 -0.0728011 -0.0031511 -0.0505705 0.1557647 -0.0422632 -0.0026829 -0.0438878 0.1529652 0.1181183 0.0087152 0.0526495 -0.0105333 0.1600733 -0.0491708 0.0390225 -0.0562634 0.1389273 0.2826207 0.0407571 -0.117123 0.0204406 0.2704386 -0.0297507 -0.1451087 0.0024676 0.284001 0.4391228 0.0489249 0.0363622 -0.0128741 0.2154334 -0.1346724 0.032898 -0.0839145 0.3132652 unknown
polarizability: 136.7000176|4.9481073|86.0495557|-4.1486395|22.0740815|76.8112735 unknown
InChI: InChI=1S/C5H6N4O4/c10-5(7-11)3-8-2-1-4(6-8)9(12)13/h1-2,7,11H,3H2
charge 0 multiplicity 1
19 atoms
O  -2.980866 -1.108501 -0.713074
O  -4.424621 1.133153 -0.445033
O  3.985135 0.267289 -0.591775
O  3.157303 1.596641 1.078814
N  -0.228043 -0.675341 0.563089
N  0.744571 0.226597 0.953851
N  3.048519 0.643459 0.220973
N  -3.35665 0.820406 0.458314
C  -1.530551 -0.636805 1.241153
C  0.185544 -1.515629 -0.465265
C  1.791036 -0.086915 0.130502
C  1.50332 -1.155812 -0.768508
C  -2.660091 -0.335958 0.255473
H  -1.445607 0.119032 2.037746
H  -1.740575 -1.617992 1.702504
H  -0.483362 -2.255041 -0.898999
H  2.165048 -1.582342 -1.515526
H  -3.182062 1.57661 1.119043
H  -4.392748 0.343849 -1.076982
