program: Gaussian 09
title: 000146862
version: EM64L-G09RevD.01
frameworkgroup: C1[X(C15H14I2N2O5S)]
method: RPBEPBE
basis: SDD
operation: Freq
keyword: #p
keyword: freq=noraman
keyword: PBEPBE/SDD
title: #p freq=noraman PBEPBE/SDD
converged: YES YES NO NO
title: Mulliken charges:
elementType: I I S O O O O O N N C C C C C C C C C C C C C C C H H H H H H H H H H H H H H
charge: 0.134617 0.162070 0.180763 -0.164491 -0.414491 -0.195942 -0.267753 -0.378245 -0.106348 -0.396701 -0.463217 -0.140762 -0.093416 -0.159293 0.108405 -0.653063 -0.688458 0.154480 0.181094 0.277646 -0.292832 -0.289282 -0.527941 -0.506734 0.581518 0.317992 0.292245 0.314457 0.253962 0.241722 0.223869 0.230956 0.238567 0.243696 0.323318 0.388570 0.295729 0.242541 0.350751
chargesum: 0.00000
title: Mulliken charges with hydrogens summed into heavy atoms:
elementType: I I S O O O O O N N C C C C C C C C C C C C C C C
charge: 0.134617 0.162070 0.180763 -0.164491 -0.025921 -0.195942 -0.267753 -0.027494 -0.106348 -0.073384 -0.145225 -0.140762 0.198829 0.155164 0.108405 0.066490 0.024761 0.154480 0.181094 0.277646 0.002897 -0.046741 -0.527941 -0.506734 0.581518
polarizability: 3.72190441e+02 -2.43485851e+01 2.83708509e+02 1.44857158e+01 4.39312791e+00 1.53216991e+02
1716.lowfreq: -9.3280 -2.8610 -0.0010 -0.0003 0.0005 2.2383 3.9379 14.3398 17.9043
frequency: -6.6410 14.0825 17.8692 35.3007 53.1640 57.5263 64.2172 72.8784 81.0761 101.7232 108.0250 117.6389 136.3898 175.8610 180.3619 198.2358 217.2472 227.4093 237.1740 244.2881 249.1477 255.5690 285.0729 291.0860 308.3440 326.2811 340.7668 352.0960 362.9081 424.8291 452.1174 455.9226 475.9061 485.9007 495.4100 520.7928 528.2576 548.2492 580.0810 583.2426 608.7489 622.5418 630.2411 655.6284 682.4737 692.5860 706.9001 719.3791 739.2819 763.6994 789.0460 830.1773 843.6294 876.6484 879.0116 904.3039 935.3331 939.4768 942.2430 953.5077 991.9860 1008.0019 1027.3468 1032.5729 1064.2545 1092.8575 1123.4569 1134.5609 1153.0379 1165.7859 1185.2577 1195.0900 1215.9673 1223.5499 1233.9741 1247.9613 1255.8229 1275.0374 1281.8504 1290.4128 1322.3278 1360.8277 1371.4748 1384.2835 1388.7078 1402.8977 1448.2301 1458.7193 1462.6081 1478.3001 1479.5882 1484.9999 1537.6818 1584.6334 1596.3911 1680.9567 1733.2885 2982.7993 2987.0817 3026.6872 3057.7934 3078.0120 3084.4530 3095.6021 3106.5078 3110.0487 3156.4592 3171.2478 3441.4447 3514.9405 3537.6644
redmass: 6.2676 9.4326 9.1520 7.2726 10.0301 10.0874 8.8327 10.8559 22.2280 8.6077 7.9208 14.4296 7.9805 8.9229 4.6949 6.2302 4.9709 3.7772 3.8477 1.3959 8.7380 3.3672 1.2176 2.9835 8.9596 8.2507 4.0767 6.6347 3.5680 5.2579 3.5896 1.3651 4.4596 4.0328 5.7181 4.4085 4.0748 4.2470 2.7428 2.7371 2.0237 1.7508 3.7858 5.6610 8.3059 3.7353 5.3936 10.3432 4.1037 7.1724 6.9781 4.9225 5.6798 1.5854 5.4660 4.8278 2.6885 1.4253 1.4633 3.1563 3.8575 1.4314 4.5291 2.9488 2.8686 2.9650 1.7737 1.5430 1.5943 1.9493 2.1768 2.2801 1.3273 1.8319 1.7528 1.7291 1.9489 2.2775 1.6655 2.4013 2.1931 1.5370 3.5145 1.1942 5.8159 1.1922 3.2836 1.0500 1.0467 1.0495 1.0597 2.1884 6.7356 7.2557 7.5076 9.0772 12.7468 1.0378 1.0360 1.0843 1.0839 1.0969 1.0989 1.1008 1.1000 1.0911 1.0921 1.0928 1.0648 1.0642 1.0774
irintensity: 0.4645 0.2003 0.2120 1.0998 1.1677 1.2682 2.5253 0.0166 0.8303 1.4041 4.9358 3.1264 1.7609 5.7374 0.9423 3.2740 1.7316 0.4672 0.9831 2.0147 3.9061 8.7200 0.4396 0.8081 10.0451 5.8935 0.4754 12.9440 2.3411 8.6748 37.8073 102.3331 18.4939 7.6804 15.7429 13.0333 23.2929 42.4291 40.7638 49.7563 46.9122 100.1839 26.0648 18.6291 63.1446 43.9410 7.6693 4.7954 34.9152 1.8115 4.7234 4.7552 28.2286 9.9124 3.1567 33.0560 1.2516 11.3409 1.6865 13.1457 5.9508 7.7374 6.5747 161.3106 250.4817 10.9140 87.0371 139.7806 18.5541 14.0194 4.3153 32.9126 20.4429 9.8817 309.5071 8.8192 5.5713 299.8847 36.3915 110.0702 148.5035 24.1216 16.7414 28.0364 2.8779 16.7640 183.7352 0.3405 8.3297 18.9922 1.1344 453.3110 92.9203 37.9090 107.5968 200.1640 367.8816 18.6041 18.0523 5.2316 36.3022 10.5645 18.0378 14.6752 14.9717 9.9942 3.4480 3.0864 81.6564 37.0248 29.0229
temp: 298.150 k
press: 1.00000 atm
elementType: 53 53 16 8 8 8 8 8 7 7 6 6 6 6 6 6 6 6 6 6 6 6 6 6 6 1 1 1 1 1 1 1 1 1 1 1 1 1 1
symmnumber: 1
zpe: 712392.6 jmol-1
zpe.correction: 0.271336 hartree
zpe.thermalcorrener: 0.295970 hartree
zpe.thermalcorrenthalpy: 0.296914 hartree
zpe.thermalcorrgfe: 0.212629 hartree
zpe.sumelectzpe: -1484.864396 hartree
zpe.sumelectthermal: -1484.839762 hartree
zpe.sumelectthermalent: -1484.838818 hartree
zpe.sumelectthermalfe: -1484.923103 hartree
dipole: -3.7990 4.7902 4.0033
dipole: 7.3079
quadrupole: -150.1004 -182.1718 -194.4998
quadrupole: -4.2576 -14.7544 -2.4631
quadrupole: 25.4903 -6.5812 -18.9091 -4.2576 -14.7544 -2.4631
hfenergy: -1485.1357317 hartree
pointgroup: C01 [X(C15H14I2N2O5S1)]
dipole: -1.4980239 2.4213807 0.3990566 debye
polarizability: 370.272721|-12.8508553|256.1775494|30.5291181|-54.0636296|182.6656701 unknown
InChI: InChI=1S/C15H14I2N2O5S/c1-15(2)10(14(23)24)19-12(22)8(13(19)25-15)18-11(21)5-3-6(16)9(20)7(17)4-5/h3-4,8,10,13,18,20,23H,1-2H3
charge 0 multiplicity 1
39 atoms
I  4.40953 3.2001 -1.679682
I  6.947801 -1.341147 1.612831
S  -1.898233 1.107457 1.362288
O  -1.807602 -0.835543 -2.463913
O  -6.274357 0.639509 -0.960393
O  -5.734994 -1.344021 0.13328
O  1.556596 -2.577769 0.471465
O  6.617901 1.378305 -0.000856
N  -2.931675 -0.702214 -0.309723
N  0.393874 -0.626989 -0.035246
C  -2.043263 -0.72926 0.879282
C  -3.743593 1.384098 0.775861
C  -3.964739 0.326319 -0.40724
C  -0.888134 -1.281973 -0.04254
C  -1.871609 -0.947028 -1.230006
C  -4.660501 1.127024 1.99185
C  -3.878959 2.825758 0.254817
C  -5.378527 -0.260345 -0.362213
C  1.571534 -1.340124 0.190638
C  2.853942 -0.562438 0.101601
C  3.99924 -1.133307 0.714056
C  2.974203 0.674173 -0.581188
C  4.219372 1.325132 -0.622988
C  5.23573 -0.47336 0.672369
C  5.373516 0.776759 0.004921
H  -2.371494 -1.336398 1.732554
H  -3.851072 0.844549 -1.377714
H  -0.715897 -2.363572 0.092667
H  -4.574994 0.092008 2.364693
H  -4.389422 1.811499 2.812371
H  -5.718468 1.315367 1.725799
H  -3.703132 3.55553 1.064464
H  -3.163282 3.029491 -0.560365
H  -4.903086 2.983161 -0.131532
H  0.406657 0.390055 -0.134486
H  -7.196234 0.264542 -0.927351
H  3.888506 -2.102513 1.208421
H  2.126491 1.111775 -1.116599
H  6.596773 2.239693 -0.502196
