program: Gaussian 09
title: 000146774
version: EM64L-G09RevD.01
frameworkgroup: C1[X(C8H9N3O4)]
method: RPBEPBE
basis: SDD
operation: Freq
keyword: #pfreq=noraman
keyword: PBEPBE/SDD
title: #p freq=noraman PBEPBE/SDD
converged: YES YES NO NO
title: Mulliken charges:
elementType: O O O O N N N C C C C C C C C H H H H H H H H H
charge: -0.226285 -0.153972 -0.245776 -0.425444 -0.147266 -0.023253 0.077673 -0.311584 0.191940 -0.108824 -0.283435 -0.335361 0.013140 0.000768 -0.388846 0.257527 0.242809 0.280939 0.269967 0.239224 0.255874 0.250719 0.225068 0.344397
chargesum: 0.00000
title: Mulliken charges with hydrogens summed into heavy atoms:
elementType: O O O O N N N C C C C C C C C
charge: -0.226285 -0.153972 -0.245776 -0.081047 -0.147266 -0.023253 0.077673 0.188752 0.191940 0.172116 -0.013468 0.159737 0.013140 0.000768 0.086941
polarizability: 1.64010970e+02 -2.67712993e+00 1.28786117e+02 -1.53437981e+01 -8.61549452e-01 9.08351555e+01
1716.lowfreq: -9.4532 -4.3127 -0.0005 -0.0004 -0.0003 2.0928 16.5868 22.1927 30.6044
frequency: 16.5595 22.1798 30.5941 52.5026 64.8310 91.1541 126.1692 146.8414 196.0841 216.8778 247.8924 266.6538 308.7836 323.0143 354.1130 411.5292 425.9306 460.5898 535.4868 565.3632 605.9064 630.2489 695.5928 704.9944 760.8330 778.8589 786.1844 837.5787 869.4072 883.4607 931.0587 968.6351 974.3599 1008.1273 1022.2798 1065.2617 1108.4922 1138.7074 1169.0592 1178.6425 1196.1140 1207.6819 1222.9771 1280.4588 1294.7962 1333.6882 1356.2794 1361.2625 1364.3382 1371.7925 1378.0623 1421.4113 1447.9408 1450.6822 1452.3611 1468.2704 2279.8849 2959.5053 2963.7933 3018.8763 3046.9683 3068.1094 3121.2377 3232.5669 3257.3159 3561.9062
redmass: 5.8609 5.8296 4.6205 5.9807 4.7617 4.3523 3.7433 6.2676 5.5394 5.7522 2.3785 5.4770 4.2415 1.8162 2.8642 3.9410 5.8123 6.0262 6.2925 6.5981 5.7917 4.7670 9.8329 6.1255 9.6163 1.7914 2.2412 5.8599 1.4464 6.6712 4.1820 1.7632 1.8248 4.7126 2.6095 1.5990 2.9142 4.1184 1.4143 2.1809 1.1062 2.6163 1.9246 2.9316 1.2019 3.1365 2.8351 3.1442 2.1381 1.2190 1.7489 1.7099 1.5906 1.0794 1.1284 1.9743 11.7553 1.0686 1.0563 1.1038 1.0565 1.0918 1.1107 1.0925 1.1086 1.0665
irintensity: 1.9800 3.3575 3.4339 1.9776 4.5311 0.9573 1.8235 5.2015 9.4750 4.4449 45.1653 7.7501 3.1654 130.7279 23.2966 7.4717 2.1366 0.3573 10.2014 4.3270 24.2646 2.8669 20.9859 32.5919 27.1916 27.6739 39.8342 25.3061 2.0715 5.4467 121.0958 18.3924 2.2194 180.3994 102.5594 13.8598 9.6702 104.5708 14.1952 70.9123 2.2063 74.7157 27.9784 128.7687 7.0629 125.2206 14.8799 282.7735 28.3977 22.7158 5.2099 1.1007 16.0036 9.2129 2.7845 21.5284 4.2448 49.0452 22.0194 14.4631 29.5702 8.9081 1.9834 3.3585 0.3974 9.2333
temp: 298.150 k
press: 1.00000 atm
elementType: 8 8 8 8 7 7 7 6 6 6 6 6 6 6 6 1 1 1 1 1 1 1 1 1
symmnumber: 1
zpe: 449192.5 jmol-1
zpe.correction: 0.171088 hartree
zpe.thermalcorrener: 0.186185 hartree
zpe.thermalcorrenthalpy: 0.187129 hartree
zpe.thermalcorrgfe: 0.124719 hartree
zpe.sumelectzpe: -774.077843 hartree
zpe.sumelectthermal: -774.062747 hartree
zpe.sumelectthermalent: -774.061802 hartree
zpe.sumelectthermalfe: -774.124212 hartree
dipole: -1.3612 2.1126 2.0830
dipole: 3.2642
quadrupole: -107.5068 -86.5610 -82.4881
quadrupole: 21.3452 10.3522 0.0639
quadrupole: -15.3215 5.6243 9.6972 21.3452 10.3522 0.0639
hfenergy: -774.2489317 hartree
pointgroup: C01 [X(C8H9N3O4)]
dipole: -0.4998878 -1.1607213 -0.2281669 debye
dipolederiv: -1.1330403 0.1354942 0.0009697 0.4135674 -0.4130559 -0.1346431 0.2669324 -0.1093741 -0.4931461 -0.6067454 -0.3250507 -0.0410609 -0.3504024 -0.7023016 0.0989864 -0.1032718 0.0375905 -0.2463218 -0.7275696 0.0746503 -0.2845073 -0.02665 -0.4972807 0.1371241 -0.2958917 0.2167597 -0.5408881 -0.6197169 0.1957756 0.1076763 0.1723581 -0.2868232 0.0708416 0.3196206 0.094931 -0.7412153 -0.7951858 0.0628118 -0.3580369 0.0037681 0.1591258 -0.092755 -0.6338655 -0.1902138 -0.4763523 -0.3914094 -0.1700631 -0.0274611 0.0634935 0.0974077 -0.1305758 -0.2737749 -0.2965233 -0.178032 1.0745783 0.2607132 0.3293353 0.3595242 1.5307301 -0.5511057 0.402415 -0.5678298 0.6943355 1.4775206 -0.0619252 0.1177863 0.0694106 0.2705425 0.0427592 0.2525304 0.1682903 0.6239503 0.3686223 0.1761459 0.126203 0.1943455 -0.5409358 0.458644 0.2042824 0.5366863 -0.0172257 0.1268736 0.2974171 0.0079598 -0.1625719 -0.1173951 -0.0767008 0.3155566 0.3247633 -0.0628124 -0.1111492 -0.3062497 0.2663849 -0.1118787 -0.3206328 0.0619604 0.1010078 -0.2449572 0.1216672 0.9279719 -0.1433096 -0.1088858 -0.5902499 0.4863815 0.1447784 -0.2491502 0.0779647 0.4406833 -0.3957147 0.0677835 0.0703438 -0.0368513 -0.1767786 -0.0115978 0.0781739 -0.034408 -0.1153066 -0.1494884 0.0035156 0.042774 0.080931 -0.1076041 0.0119334 0.0125686 0.0169671 -0.2765575 0.5862194 -0.05618 -0.1119048 -0.0539202 0.3286228 -0.0529922 -0.2994183 -0.080447 0.7656448 -0.0136273 0.0061617 0.0331754 -0.0051084 0.0772123 0.1432187 0.0238065 0.0231426 0.0320418 -0.0807457 0.0478363 0.0036298 0.0314141 -0.0524489 -0.1130632 -0.0021953 -0.0168792 0.0635277 0.1374755 -0.0822243 -0.0400365 -0.0594177 0.0906892 0.0117199 -0.0401451 -0.008557 0.1440228 0.1272983 0.021673 -0.0717211 -0.0046296 0.083122 0.0531395 -0.0646497 0.0689564 0.077666 -0.0748665 -0.0444841 -0.0503078 0.0763577 0.0007611 -0.0598835 -0.0715759 -0.0728654 -0.0478448 0.0193906 -0.01354 0.0799421 0.1045751 -0.0104666 0.0182253 0.1013386 0.0757365 -0.0243827 0.0000519 -0.0531186 -0.010703 -0.0954447 0.0200415 -0.0775895 0.0360928 -0.0401087 0.0082974 -0.0434031 0.0771287 0.0065653 0.1161786 -0.0799423 0.1105246 0.0473873 0.0651789 -0.0254037 0.2966601 -0.1709616 -0.0881206 -0.1887992 0.161029 -0.0629487 -0.1277746 -0.0448036 0.273652 unknown
polarizability: 164.8317728|10.6679534|119.5424745|5.4721484|-17.6579322|99.2579952 unknown
InChI: InChI=1S/C8H9N3O4/c12-5-1-2-6-15-7-10-4-3-9-8(10)11(13)14/h3-4,12H,5-7H2
charge 0 multiplicity 1
24 atoms
O  -0.822053 -1.104301 -1.064729
O  3.336693 2.283921 -0.688247
O  1.381785 1.689968 -1.718936
O  -5.578252 -0.299558 1.80076
N  1.553289 -0.898517 -0.527709
N  3.203739 -0.077282 0.830697
N  2.38185 1.457846 -0.908439
C  0.52036 -1.089525 -1.593587
C  2.391235 0.186571 -0.212199
C  1.87347 -1.893991 0.393828
C  2.882919 -1.372412 1.219015
C  -1.336416 0.251453 -0.696279
C  -2.745636 0.136737 -0.330994
C  -3.935823 0.068367 -0.012108
C  -5.355159 -0.003396 0.373487
H  0.674128 -0.304218 -2.350728
H  0.66562 -2.095348 -2.016881
H  1.361169 -2.852965 0.390609
H  3.384436 -1.849226 2.057124
H  -0.747878 0.647592 0.156459
H  -1.197991 0.939304 -1.554127
H  -5.848682 -0.834388 -0.158293
H  -5.864111 0.940445 0.083043
H  -5.055691 0.343019 2.345333
