program: Gaussian 09
title: 000146771
version: EM64L-G09RevD.01
frameworkgroup: C1[X(C6H5Cl5O)]
method: RPBEPBE
basis: SDD
operation: Freq
keyword: #p
keyword: freq=noraman
keyword: PBEPBE/SDD
title: #p freq=noraman PBEPBE/SDD
converged: NO YES NO NO
title: Mulliken charges:
elementType: Cl Cl Cl Cl Cl O C C C C C C H H H H H
charge: 0.014590 0.044998 0.027524 0.035334 0.048248 -0.179292 -0.006020 0.014298 -0.404206 -0.421075 -0.365411 -0.404645 0.279185 0.327910 0.321616 0.355263 0.311683
chargesum: 0.00000
title: Mulliken charges with hydrogens summed into heavy atoms:
elementType: Cl Cl Cl Cl Cl O C C C C C C
charge: 0.014590 0.044998 0.027524 0.035334 0.048248 -0.179292 -0.006020 0.293484 -0.076296 -0.099459 -0.010148 -0.092961
polarizability: 1.35924774e+02 -2.75678197e+00 1.09202661e+02 4.26260367e+00 1.24653067e+00 8.45336019e+01
1716.lowfreq: -10.2313 -5.8611 -0.0019 -0.0017 0.0019 7.6152 40.5598 57.6644 114.4520
frequency: 40.5085 57.6460 114.4499 152.2044 158.6196 167.0089 182.0058 192.5786 247.3840 276.2764 292.6167 344.3907 375.4714 427.9613 471.9253 516.6747 586.1269 633.7199 687.9584 688.7718 717.2548 802.2899 871.4722 880.6907 920.7843 948.2983 1000.1274 1048.1004 1113.7159 1128.7563 1177.8349 1191.4250 1202.5141 1239.1395 1244.1759 1285.3140 1293.6321 1307.6803 1338.6897 1373.3875 3036.5229 3091.4111 3095.0967 3109.4885 3146.2173
redmass: 23.4769 23.0200 14.9354 22.1564 18.2582 23.3544 28.4219 12.3572 17.6071 18.3566 11.9746 6.1674 10.6719 5.7798 6.8311 5.6174 6.2450 8.8055 9.0558 7.1543 5.7760 4.8196 5.6136 6.7578 3.0937 3.9448 2.8107 2.8778 2.4781 2.2693 1.1326 1.1128 1.1461 1.2607 1.3436 1.3409 1.6943 1.3782 1.3253 2.9706 1.0851 1.0866 1.0875 1.0872 1.0920
irintensity: 0.1743 0.3261 1.1756 0.5291 0.6384 0.7818 0.2564 2.5077 0.8206 0.1443 0.5830 7.0578 2.4854 11.7802 20.5235 34.9684 29.4212 12.1484 32.4753 83.0378 17.8771 19.3164 39.0890 14.6764 21.2314 2.5411 8.9879 2.5072 16.1275 12.6996 3.2066 1.7914 8.1883 15.1348 3.9923 2.2871 2.7262 9.6613 4.6010 20.0303 5.0227 2.6312 2.7776 0.5956 3.5766
temp: 298.150 k
press: 1.00000 atm
elementType: 17 17 17 17 17 8 6 6 6 6 6 6 1 1 1 1 1
symmnumber: 1
zpe: 264245.0 jmol-1
zpe.correction: 0.100646 hartree
zpe.thermalcorrener: 0.112904 hartree
zpe.thermalcorrenthalpy: 0.113848 hartree
zpe.thermalcorrgfe: 0.060145 hartree
zpe.sumelectzpe: -2606.197455 hartree
zpe.sumelectthermal: -2606.185197 hartree
zpe.sumelectthermalent: -2606.184253 hartree
zpe.sumelectthermalfe: -2606.237956 hartree
dipole: 0.3116 -1.6556 -3.5638
dipole: 3.9419
quadrupole: -115.2686 -106.2419 -102.0608
quadrupole: -1.8441 1.2924 4.9172
quadrupole: -7.4115 1.6152 5.7963 -1.8441 1.2924 4.9172
hfenergy: -2606.2981009 hartree
pointgroup: C01 [X(C6H5Cl5O1)]
dipole: -0.1069573 0.6710607 -1.3940722 debye
dipolederiv: -0.7041421 -0.0224917 0.3023945 -0.0559904 -0.1924586 0.0074185 0.3176081 -0.000739 -0.2619358 -0.3001536 0.1378349 -0.1018513 0.1429142 -0.2825891 0.0910593 -0.1660206 0.1880833 -0.2164855 -0.2537979 0.0939164 0.0957515 0.0598312 -0.2340474 -0.1046846 0.1773821 -0.1863656 -0.3063733 -0.1991025 -0.1244817 0.0166378 -0.1337285 -0.4745168 0.0167073 -0.0184852 -0.0336306 -0.1158175 -0.5729461 -0.0163515 -0.058156 -0.0310302 -0.1379743 0.0172561 -0.0233694 0.0271485 -0.0954263 -0.4982051 -0.0521519 0.0267938 0.1132246 -0.3684771 -0.1425998 -0.003388 -0.0783061 -0.4581693 1.0787056 0.0625503 -0.5115679 -0.0847719 0.3744774 0.1261818 -0.6168921 0.0640986 0.5224763 0.1959524 0.0258082 0.0153975 0.0130119 0.1201221 -0.0712699 0.139273 -0.0773499 0.026158 0.2153182 -0.1812969 0.2809243 -0.181189 0.26848 -0.205589 0.2362345 -0.2058766 0.294931 0.1772861 -0.1524792 -0.1107297 0.0213846 0.261947 0.1804758 -0.1434727 0.3482383 0.4734228 0.07971 0.2202377 -0.0328466 0.1309781 0.5348063 0.1017483 0.022045 0.0757056 0.0386279 0.6734662 0.0047301 0.0569537 0.0030907 0.0763718 -0.0188727 0.0605551 -0.1934046 0.0657888 -0.0166188 -0.0149585 0.0036584 -0.0273223 -0.0017367 0.0732217 -0.0098472 0.0327857 0.0757865 0.0435251 0.0157731 -0.0320409 0.0325822 0.0314278 0.0058423 -0.0226339 0.0239297 -0.0319115 0.036871 0.0384586 0.001952 0.0157669 0.0008195 0.0147637 0.0027701 0.0076256 -0.0438178 0.0515926 -0.0283856 -0.000229 -0.0228963 0.0047459 -0.0371762 -0.0048342 -0.0109573 0.0459877 -0.0074612 -0.0067123 0.0469579 0.0041443 0.0186022 -0.0544826 0.0530755 0.0190143 -0.013242 unknown
polarizability: 134.7858869|-5.2559162|109.9922806|-6.1256573|-0.4510478|84.8828693 unknown
InChI: InChI=1S/C6H5Cl5O/c7-1-2(8)4(10)6(11)5(12-6)3(1)9/h1-5H
charge 0 multiplicity 1
17 atoms
Cl 3.092601 0.47173 -1.079031
Cl 1.887389 -1.992607 1.106062
Cl -1.664716 2.0736 1.244108
Cl -1.230106 -2.798795 -0.081023
Cl -3.241173 -0.235033 -0.478805
O  1.251408 1.228861 0.921977
C  1.436617 0.382611 -0.253016
C  0.534194 1.581896 -0.379034
C  0.888396 -1.030185 -0.163004
C  -0.978599 1.413289 -0.385387
C  -0.609718 -1.052016 0.222738
C  -1.386146 -0.050523 -0.652521
H  0.941096 2.478553 -0.85736
H  1.047811 -1.562624 -1.113505
H  -1.434585 2.061457 -1.148343
H  -0.7591 -0.856338 1.295068
H  -1.197668 -0.267376 -1.720123
