program: Gaussian 09
title: 000146773
version: EM64L-G09RevD.01
frameworkgroup: C1[X(C8H13N3O4)]
method: RPBEPBE
basis: SDD
operation: Freq
keyword: #p
keyword: freq=noraman
keyword: PBEPBE/SDD
title: #p freq=noraman PBEPBE/SDD
converged: YES YES NO NO
title: Mulliken charges:
elementType: O O O O N N N C C C C C C C C H H H H H H H H H H H H H
charge: -0.256031 -0.452437 -0.163088 -0.242982 -0.127995 -0.030472 0.083623 -0.390938 -0.357960 -0.265983 -0.234609 -0.332153 0.205538 -0.129187 -0.285740 0.206349 0.215521 0.218182 0.210170 0.231659 0.190938 0.243979 0.200544 0.187632 0.193566 0.270724 0.267301 0.343849
chargesum: 0.00000
title: Mulliken charges with hydrogens summed into heavy atoms:
elementType: O O O O N N N C C C C C C C C
charge: -0.256031 -0.108588 -0.163088 -0.242982 -0.127995 -0.030472 0.083623 0.030933 0.070392 0.156613 0.209913 0.049045 0.205538 0.141536 -0.018439
polarizability: 1.53841326e+02 1.23763339e+01 1.33157669e+02 2.12676157e+01 -1.12306959e+00 9.31091691e+01
1716.lowfreq: -7.2182 -5.3152 -2.1856 -0.0009 -0.0008 -0.0007 17.2207 24.2705 40.9717
frequency: 16.9388 24.1207 40.9584 47.9044 72.9848 98.0782 108.1328 128.2836 139.6732 183.0570 224.0059 249.3494 261.3067 279.2435 333.1860 397.3065 399.8023 446.7929 504.7515 526.2392 627.7776 630.1208 700.7945 725.2075 764.9622 771.2951 772.7008 820.6153 863.3598 879.4032 891.1457 935.0843 968.1817 1004.3094 1012.3079 1036.7837 1061.9075 1071.9423 1095.9147 1113.8820 1134.1115 1142.3251 1166.6130 1201.2104 1215.2897 1231.5387 1248.4524 1275.8975 1283.1178 1288.0628 1291.2634 1339.4645 1346.6551 1356.5343 1363.7157 1369.8998 1404.8160 1415.6642 1423.5132 1451.7797 1472.7203 1474.0116 1478.3106 1484.9520 1493.4976 2929.7278 2950.6322 2978.1491 2988.6361 2989.7485 2997.2291 3017.6260 3042.1304 3069.3700 3072.8989 3230.5897 3255.9330 3568.5468
redmass: 7.6975 4.2475 8.8793 2.3215 4.1284 3.8939 2.6962 3.5339 3.0429 5.8936 5.2979 6.9891 5.2653 1.0868 2.9896 6.9126 3.2259 7.0230 4.6126 4.4454 3.2810 9.5224 10.5853 6.3168 2.9817 1.0800 1.8393 1.1356 1.4369 5.9954 6.4179 1.1936 7.4959 2.9538 2.5943 3.4225 2.9631 1.5863 2.5462 3.1022 1.5254 3.7936 1.1710 1.5677 1.3209 3.1230 1.2830 1.2713 1.1347 2.4509 1.1956 1.6867 2.3730 3.1809 5.8460 1.7767 2.0400 1.4616 1.8014 1.9060 1.0952 1.2175 1.3020 1.1135 1.0952 1.0549 1.0590 1.1062 1.0599 1.0617 1.0591 1.1010 1.1044 1.1054 1.1023 1.0926 1.1083 1.0664
irintensity: 2.2937 0.4183 0.3497 4.8298 1.7103 9.2854 8.7137 0.4794 0.5101 0.9146 1.9949 1.7938 1.3499 162.0024 5.9106 4.9979 5.9063 0.4925 19.6801 10.5003 0.3704 13.8799 5.5289 32.9809 29.1155 10.9466 47.4057 0.2441 3.4714 12.9015 6.1067 1.4105 89.6240 55.1489 18.5112 217.7995 24.0777 8.7993 4.0382 9.3020 0.4584 98.8771 1.5452 28.5073 9.3986 62.8136 0.6825 28.8288 27.7853 98.4987 6.9464 100.7133 57.5818 3.1730 221.0735 12.2645 7.9168 4.9285 0.4625 4.0121 2.0809 5.9980 7.7150 3.4962 14.7856 64.9381 51.4393 48.0658 1.0963 64.1423 66.6175 9.5340 0.2952 92.9018 3.9606 1.8507 1.2351 2.5024
temp: 298.150 k
press: 1.00000 atm
elementType: 8 8 8 8 7 7 7 6 6 6 6 6 6 6 6 1 1 1 1 1 1 1 1 1 1 1 1 1
symmnumber: 1
zpe: 572260.3 jmol-1
zpe.correction: 0.217962 hartree
zpe.thermalcorrener: 0.233668 hartree
zpe.thermalcorrenthalpy: 0.234612 hartree
zpe.thermalcorrgfe: 0.171149 hartree
zpe.sumelectzpe: -776.494717 hartree
zpe.sumelectthermal: -776.479012 hartree
zpe.sumelectthermalent: -776.478068 hartree
zpe.sumelectthermalfe: -776.541530 hartree
dipole: 0.8344 -6.0032 0.0132
dipole: 6.0609
quadrupole: -86.2971 -92.3279 -85.8954
quadrupole: 16.6742 -13.7375 -2.8999
quadrupole: 1.8764 -4.1544 2.2781 16.6742 -13.7375 -2.8999
hfenergy: -776.7126796 hartree
pointgroup: C01 [X(C8H13N3O4)]
dipole: -0.497959 -2.2390646 -0.6516366 debye
polarizability: 151.2196795|-19.3021782|132.2998925|17.6547527|10.3051108|96.5885914 unknown
InChI: InChI=1S/C8H13N3O4/c12-5-1-2-6-15-7-10-4-3-9-8(10)11(13)14/h3-4,12H,1-2,5-7H2
charge 0 multiplicity 1
28 atoms
O  -0.566325 -1.138534 -0.421305
O  -6.369802 0.88031 0.363953
O  2.089836 2.441774 0.956398
O  0.687306 1.696345 -0.689995
N  1.793954 -0.901638 -0.478653
N  3.35508 -0.067992 0.96944
N  1.65094 1.525062 0.173586
C  -2.798672 -0.437399 0.208278
C  -4.125175 0.227237 -0.225171
C  -1.772556 -0.435387 -0.926427
C  0.580021 -1.063905 -1.304459
C  -5.146401 0.272774 0.914821
C  2.260736 0.213266 0.234734
C  2.653067 -1.945535 -0.144652
C  3.609266 -1.413835 0.736316
H  -2.979147 -1.482923 0.525433
H  -2.363859 0.095035 1.07594
H  -3.942635 1.261807 -0.574103
H  -4.575197 -0.326193 -1.072359
H  -1.496143 0.598396 -1.213921
H  -2.170371 -0.969754 -1.815578
H  0.504957 -0.211584 -2.00037
H  0.704455 -2.013176 -1.861712
H  -5.348867 -0.756184 1.286101
H  -4.747594 0.876992 1.758711
H  2.509628 -2.949582 -0.536273
H  4.449424 -1.918105 1.206414
H  -7.049624 0.961528 1.079251
