program: Gaussian 09
title: 000146770
version: EM64L-G09RevD.01
frameworkgroup: C1[X(C5H8Cl2O4)]
method: RPBEPBE
basis: SDD
operation: Freq
keyword: #p
keyword: freq=noraman
keyword: PBEPBE/SDD
title: #p freq=noraman PBEPBE/SDD
converged: YES YES NO NO
title: Mulliken charges:
elementType: Cl Cl O O O O C C C C C H H H H H H H H
charge: 0.069104 0.059658 -0.239936 -0.494866 -0.441150 -0.231719 -0.071468 -0.338789 -0.314688 0.477059 -0.707558 0.231378 0.233209 0.257090 0.192836 0.208480 0.388891 0.354685 0.367782
chargesum: 0.00000
title: Mulliken charges with hydrogens summed into heavy atoms:
elementType: Cl Cl O O O O C C C C C
charge: 0.069104 0.059658 -0.239936 -0.105974 -0.073368 -0.231719 0.159910 0.151509 0.086629 0.477059 -0.352873
polarizability: 1.09621086e+02 -3.27115700e-02 8.39257816e+01 5.03457805e+00 1.40399082e+00 6.91091465e+01
1716.lowfreq: -2.8088 -0.0020 -0.0008 0.0016 2.8026 6.6489 13.7218 39.7041 65.3018
frequency: 13.4781 39.6816 65.2974 103.2944 123.4391 163.0586 176.8722 198.7089 247.0110 277.9678 298.1536 350.4255 416.2121 457.1983 520.6395 536.0776 597.6281 630.7086 671.5004 719.0111 748.4144 818.5738 849.8429 907.6552 942.2370 1007.3683 1049.0634 1063.3415 1072.1217 1115.4538 1177.9477 1202.8330 1229.3208 1258.6253 1267.7216 1305.6375 1318.7831 1353.8730 1386.8633 1395.2690 1436.4781 1463.7554 1644.8109 2941.2673 2970.2285 3030.5789 3072.2192 3115.0781 3158.0056 3443.5201 3505.5190
redmass: 8.7217 8.0568 8.7570 8.3742 3.4514 5.2932 7.3209 7.0045 4.7483 8.9121 13.4164 3.9074 3.8204 3.5253 1.1397 3.2651 1.7231 2.3073 6.4569 5.7656 9.8118 5.5505 3.5213 1.8627 5.9380 4.8195 2.2638 4.3634 2.1526 2.5107 1.1455 1.0668 1.1359 1.1635 1.7297 1.1703 1.2771 1.2502 1.4103 1.2617 1.0968 1.0889 9.4531 1.0697 1.0827 1.0593 1.0948 1.1067 1.0890 1.0657 1.0646
irintensity: 0.3725 2.1044 1.1936 4.8074 1.0718 4.8487 3.4388 1.2203 5.6844 11.0463 2.9849 2.8454 8.6655 3.9182 206.7966 16.2427 16.2467 242.4625 21.1636 22.0039 39.3209 2.0433 44.4682 10.3665 74.7077 66.0483 54.9205 27.7839 26.0355 235.5174 14.0623 9.5461 5.5835 34.5590 62.9622 69.9519 5.6180 4.9248 101.6061 34.3434 11.4128 3.0159 135.4116 52.3533 46.9397 20.9909 30.8777 10.8785 0.4300 188.8455 19.9146
temp: 298.150 k
press: 1.00000 atm
elementType: 17 17 8 8 8 8 6 6 6 6 6 1 1 1 1 1 1 1 1
symmnumber: 1
zpe: 352053.6 jmol-1
zpe.correction: 0.134090 hartree
zpe.thermalcorrener: 0.146528 hartree
zpe.thermalcorrenthalpy: 0.147472 hartree
zpe.thermalcorrgfe: 0.092356 hartree
zpe.sumelectzpe: -1415.434731 hartree
zpe.sumelectthermal: -1415.422292 hartree
zpe.sumelectthermalent: -1415.421348 hartree
zpe.sumelectthermalfe: -1415.476464 hartree
dipole: 1.3010 -2.4989 -2.2574
dipole: 3.6101
quadrupole: -98.1403 -77.1001 -78.2440
quadrupole: 6.7951 -1.5899 1.3761
quadrupole: -13.6455 7.3947 6.2508 6.7951 -1.5899 1.3761
hfenergy: -1415.5688207 hartree
pointgroup: C01 [X(C5H8Cl2O4)]
dipole: -0.6127096 1.1478079 -0.5695687 debye
dipolederiv: -0.1884126 -0.0925848 -0.0495952 -0.0521398 -0.5439778 -0.2422081 -0.0105288 -0.1429814 -0.1526005 -0.4072422 0.1960179 0.1626636 0.1012908 -0.2538751 -0.141066 0.1624143 -0.2179727 -0.2746916 -1.189928 -0.4172942 0.121828 -0.4795152 -0.7191844 0.2230041 0.1119936 0.2346665 -0.4340411 -0.6190508 0.0268556 0.0769643 0.0481693 -0.6266315 0.0912357 0.0827196 0.1208755 -0.673713 -0.8088938 0.1007579 -0.141437 0.149999 -0.6181463 -0.0530503 -0.1798999 -0.0374334 -0.3211119 -0.7635116 0.0587982 -0.2131483 -0.0684091 -0.5299866 0.233052 -0.072683 0.3277308 -0.633696 0.0348146 -0.0061617 -0.0864563 -0.1191118 0.2506472 -0.1049564 -0.028821 -0.1101359 0.4951269 0.7441078 0.2296623 -0.0466267 0.1797483 0.2679508 0.0711131 0.104979 0.0608512 0.2092583 0.5223235 -0.1563955 0.0668757 -0.0213574 0.5336915 0.0397929 0.0328814 -0.0002018 0.3281445 1.2318161 0.3613931 0.1096914 0.4908399 0.8080425 -0.5476882 -0.0501621 -0.6081686 0.7220245 0.4237836 -0.1497065 -0.205035 -0.068058 0.9265404 0.4458585 -0.250702 0.4120797 0.4951217 0.0344454 -0.0260927 -0.0574637 -0.0353819 -0.051999 -0.0766109 -0.0401933 -0.0469889 -0.1277895 0.0059521 -0.0472204 0.0068641 -0.0506787 -0.009999 0.0726427 0.0005831 0.1074899 0.0246835 -0.0373886 -0.0186027 0.0390745 -0.0127177 0.0662345 -0.022112 -0.0008365 -0.099309 -0.0318687 -0.0000771 0.0316836 0.0006084 0.0137025 -0.1545743 -0.1081294 -0.0215811 -0.1684192 -0.0437829 0.056604 0.0187812 0.0006016 0.008082 0.0239778 0.0642817 0.0164304 0.1127562 -0.1040734 0.4901634 -0.0797936 0.0621789 -0.0701619 0.3559668 0.0001887 0.0242034 0.0045524 0.3332724 0.0192767 -0.0111909 0.0478435 0.0053476 -0.0215512 -0.0042298 0.0086044 -0.0212823 0.006673 0.4512176 -0.0189068 0.1045681 -0.0196479 0.2968736 0.0588817 0.1105986 0.071891 0.1830636 unknown
polarizability: 109.3918117|4.2009701|83.9648084|-3.129998|2.9221865|69.2993943 unknown
InChI: InChI=1S/C5H8Cl2O4/c6-4(7)5(10)11-2-3(9)1-8/h3-4,8-9H,1-2H2
charge 0 multiplicity 1
19 atoms
Cl -2.865971 -2.110449 -0.96591
Cl -3.76617 0.350586 0.63282
O  -0.409631 0.749214 -0.537396
O  2.034366 -0.720584 1.275566
O  4.384207 -0.506478 -0.016044
O  -0.708897 -0.919998 1.076291
C  1.979233 -0.000407 0.000972
C  0.942551 1.138579 0.006642
C  3.407924 0.561673 -0.167423
C  -1.119525 -0.238295 0.112543
C  -2.496911 -0.348081 -0.540919
H  1.763008 -0.697429 -0.837506
H  1.227085 1.955418 -0.675637
H  0.804576 1.5253 1.032612
H  3.574437 1.367417 0.581829
H  3.548093 0.973642 -1.181347
H  1.120865 -1.060186 1.488103
H  -2.559378 0.239655 -1.462645
H  4.099837 -1.028777 0.782149
