program: Gaussian 09
title: 000146797
version: EM64L-G09RevD.01
frameworkgroup: C1[X(C20H24O3)]
method: RPBEPBE
basis: SDD
operation: Freq
keyword: #pfreq=noraman
keyword: PBEPBE/SDD
title: #p freq=noraman PBEPBE/SDD
converged: NO YES NO NO
title: Mulliken charges:
elementType: O O O C C C C C C C C C C C C C C C C C C C C H H H H H H H H H H H H H H H H H H H H H H H H
charge: -0.391236 -0.169016 -0.132608 0.045964 0.319932 -0.501317 -0.500937 -0.113095 -0.476646 -0.477169 -0.746272 -0.759693 -0.747350 0.294068 -0.086340 -0.139297 0.325740 -0.234089 0.306256 -0.379242 -0.374623 -0.223494 -0.235134 0.193978 0.193017 0.219230 0.218214 0.193461 0.116974 0.255968 0.205125 0.205007 0.256521 0.214858 0.207832 0.214119 0.217306 0.217867 0.209990 0.214249 0.207915 0.215172 0.356479 0.287994 0.293122 0.239098 0.242104
chargesum: 0.00000
title: Mulliken charges with hydrogens summed into heavy atoms:
elementType: O O O C C C C C C C C C C C C C C C C C C C C
charge: -0.034757 -0.169016 -0.132608 0.239942 0.319932 -0.089069 -0.089262 0.003879 -0.015553 -0.015641 -0.109464 -0.114530 -0.110015 0.294068 -0.086340 -0.139297 0.325740 -0.234089 0.306256 -0.091248 -0.081501 0.015604 0.006970
polarizability: 3.35987039e+02 -2.27011054e+01 2.26365664e+02 -1.58345765e-02 4.46728329e-02 1.40458895e+02
1716.lowfreq: -34.4087 -8.4079 -0.0006 -0.0004 0.0007 8.0012 13.5959 26.2535 32.1816
frequency: -32.2709 25.7574 32.1548 43.7610 69.8823 123.6829 130.8967 133.8391 158.4058 176.2710 183.7129 208.9015 217.7347 233.9702 238.7442 245.7923 278.1055 304.1544 320.7985 351.5912 357.4240 363.4923 370.0223 373.0485 399.6049 419.1055 430.4377 435.1585 449.6076 454.5953 465.1993 471.9746 511.3169 530.5582 545.9872 572.8945 640.5837 654.9605 680.7116 689.6489 733.3521 748.6226 788.9986 789.7149 790.5189 826.9299 869.6555 880.8543 896.1596 916.2327 920.3857 923.0191 928.6573 930.7097 933.1072 956.3097 979.1395 990.8446 1004.5550 1010.7124 1018.5483 1031.5930 1039.1589 1052.8606 1053.7543 1076.0302 1097.6876 1106.6296 1133.1933 1137.9054 1170.2650 1179.6497 1188.9239 1208.7603 1223.0253 1227.7746 1235.7780 1242.0637 1265.2078 1273.0836 1281.5516 1296.3714 1301.3984 1302.4216 1318.7635 1322.7171 1334.8321 1354.5628 1371.4485 1372.2585 1376.9411 1378.8577 1395.7557 1402.1646 1437.6115 1457.2248 1461.4026 1464.8719 1467.0282 1468.2051 1470.9339 1476.6983 1483.2299 1485.9861 1487.1700 1495.3631 1532.2887 1569.4652 1576.8302 1599.0888 1615.6213 2839.8813 2929.5256 2961.6788 2966.3169 2968.1655 2969.0462 2975.1341 2988.0448 2990.9094 3037.5064 3042.6803 3058.2175 3059.8762 3060.7308 3065.6035 3066.0407 3066.4411 3072.1262 3072.6624 3138.8356 3153.3561 3167.5625 3182.8905 3501.5168
redmass: 2.3603 4.3003 4.2415 5.2169 5.8831 4.2437 4.0240 4.2447 5.1207 2.1737 2.0434 2.2212 1.3135 1.0967 1.8968 2.3632 4.2443 2.2235 2.4106 3.3979 6.3587 4.1745 7.6954 2.1554 8.9255 4.6004 2.6744 2.8790 2.9142 2.6766 3.4255 3.6595 3.0182 1.2581 3.8933 4.9873 6.7708 4.3791 5.0940 6.3257 3.8232 2.8312 3.1882 1.4647 1.4708 3.2586 2.8525 3.0269 1.3084 2.0063 2.2781 1.6515 1.9096 2.9809 1.2400 2.3100 3.7586 1.3998 1.4580 1.3669 1.4474 2.6177 2.2973 1.9534 1.1764 3.0224 2.9582 1.9521 2.2419 2.3087 1.2716 1.2543 2.0374 1.4711 2.5813 2.1896 1.9452 1.7272 1.7263 1.3921 1.7179 4.1817 1.2610 1.4281 1.3343 1.3228 1.4628 1.4925 1.2048 1.5256 1.7194 1.5813 9.8608 1.2097 2.4264 1.0682 1.0644 1.0487 1.0687 1.0693 1.0859 1.0900 2.7633 1.0633 1.0513 1.0582 10.8844 8.4860 8.2785 7.5284 8.0775 1.0790 1.0815 1.0624 1.0367 1.0381 1.0586 1.0387 1.0630 1.0643 1.0958 1.0965 1.0996 1.0992 1.1001 1.0996 1.0994 1.0981 1.0978 1.0981 1.0865 1.0912 1.0974 1.0966 1.0646
irintensity: 0.4091 0.4814 0.7866 0.0193 0.3378 2.0370 1.1248 0.2966 0.1697 0.2082 0.2183 0.5622 0.1431 0.0824 0.5312 1.2499 2.4480 0.2277 0.3546 6.7310 3.6494 0.1238 2.5742 1.1380 3.7448 1.3872 3.6351 23.3310 3.7321 1.4006 11.9111 0.4120 2.5404 58.4383 0.9278 2.2499 5.0398 1.2330 31.2705 6.5014 5.4125 1.5019 2.2768 35.5234 27.9824 3.3705 1.0782 3.1710 11.4891 0.3741 27.3207 2.5233 0.0277 28.8822 0.0709 1.7480 8.6576 4.6303 5.7647 0.0271 1.2166 53.3503 1.1590 3.7117 0.2392 16.3820 0.0315 0.9250 42.5474 1.1413 70.4990 51.4724 5.1478 0.0095 32.5843 5.1685 12.7316 45.0776 5.5740 0.5423 9.9115 101.8711 0.3788 0.5755 1.0503 0.7988 0.0935 5.4773 22.8782 13.8160 13.5716 46.5635 4.3647 22.3270 12.0015 4.7583 0.5528 2.9678 6.2169 0.6408 10.8392 7.9379 27.0889 7.1598 9.1681 36.4307 271.9264 9.4779 113.8000 9.6737 11.6376 50.6433 9.4919 2.4894 36.6609 24.9290 59.6628 46.7526 55.4000 12.8892 42.1021 25.1529 0.7667 8.6805 2.8528 4.9515 59.6823 108.5503 59.8952 73.9129 3.9378 6.6648 18.5015 7.8093 52.6764
temp: 298.150 k
press: 1.00000 atm
elementType: 8 8 8 6 6 6 6 6 6 6 6 6 6 6 6 6 6 6 6 6 6 6 6 1 1 1 1 1 1 1 1 1 1 1 1 1 1 1 1 1 1 1 1 1 1 1 1
symmnumber: 1
zpe: 1027404.8 jmol-1
zpe.correction: 0.391318 hartree
zpe.thermalcorrener: 0.412280 hartree
zpe.thermalcorrenthalpy: 0.413224 hartree
zpe.thermalcorrgfe: 0.342225 hartree
zpe.sumelectzpe: -1000.492131 hartree
zpe.sumelectthermal: -1000.471169 hartree
zpe.sumelectthermalent: -1000.470225 hartree
zpe.sumelectthermalfe: -1000.541224 hartree
dipole: 0.4234 -5.7046 -0.0017
dipole: 5.7203
quadrupole: -115.3763 -149.6901 -139.1537
quadrupole: -9.5736 0.0078 0.0084
quadrupole: 19.3637 -14.9501 -4.4136 -9.5736 0.0078 0.0084
hfenergy: -1000.8834488 hartree
pointgroup: C01 [X(C20H24O3)]
dipole: -0.1986922 -2.2417503 -0.0015674 debye
polarizability: 336.6139517|21.1230771|225.7384242|0.257559|0.0587081|140.4592218 unknown
InChI: InChI=1S/C20H24O3/c1-20(2,3)13-10-8-12(9-11-13)16-17(21)14-6-4-5-7-15(14)18(22)19(16)23/h4-7,12-13,21H,8-11H2,1-3H3
charge 0 multiplicity 1
47 atoms
O  -1.425344 -2.400503 0.002883
O  -0.209864 2.294248 0.000016
O  -2.912603 2.940783 0.001331
C  3.771285 0.159402 0.005462
C  5.323729 -0.123552 0.008714
C  3.034244 -0.370578 -1.255218
C  3.031854 -0.358162 1.269915
C  0.803209 -0.441106 0.005799
C  1.544583 0.045966 -1.273131
C  1.542117 0.058286 1.28145
C  5.975344 0.541424 1.254909
C  5.645639 -1.643054 0.027689
C  5.97565 0.509371 -1.25387
C  -0.678495 -0.071449 0.00239
C  -1.686064 -1.031532 0.001178
C  -1.060685 1.349509 -0.000637
C  -3.130977 -0.73685 -0.001985
C  -2.572804 1.725679 -0.002591
C  -3.570137 0.619264 -0.003123
C  -4.091228 -1.778321 -0.003167
C  -4.953299 0.916959 -0.005001
C  -5.469848 -1.471066 -0.005348
C  -5.905146 -0.123942 -0.00621
H  3.664922 1.268394 -0.000481
H  3.107898 -1.478248 -1.289326
H  3.515502 0.00991 -2.17462
H  3.511665 0.030883 2.186524
H  3.10541 -1.465436 1.31472
H  0.918391 -1.555418 0.011453
H  1.464027 1.146732 -1.323235
H  1.045636 -0.36254 -2.173763
H  1.041693 -0.342002 2.184935
H  1.461254 1.159432 1.32109
H  5.648811 0.069326 2.198794
H  7.076909 0.450601 1.204552
H  5.726136 1.618629 1.306925
H  5.235408 -2.160737 -0.858873
H  5.243038 -2.137013 0.931078
H  6.741178 -1.798164 0.025164
H  5.718428 1.582543 -1.339397
H  7.077635 0.428812 -1.196083
H  5.657022 0.006366 -2.184433
H  -0.445784 -2.565764 0.005484
H  -3.749887 -2.816265 -0.00221
H  -5.254749 1.969441 -0.005688
H  -6.205108 -2.282782 -0.006289
H  -6.975096 0.108227 -0.007872
