program: Gaussian 09
title: 000146767
version: EM64L-G09RevD.01
frameworkgroup: C1[X(C7H14N2O3)]
method: RPBEPBE
basis: SDD
operation: Freq
keyword: #p
keyword: freq=noraman
keyword: PBEPBE/SDD
title: #p freq=noraman PBEPBE/SDD
converged: YES YES NO NO
title: Mulliken charges:
elementType: O O O N N C C C C C C C H H H H H H H H H H H H H H
charge: -0.257196 -0.243961 -0.254923 -0.027237 0.066137 0.149851 -0.693372 -0.687364 -0.693183 0.261648 -0.311097 -0.624785 0.216818 0.242295 0.217179 0.226576 0.208751 0.225516 0.217919 0.216605 0.244452 0.253279 0.259839 0.267487 0.259797 0.258970
chargesum: 0.00000
title: Mulliken charges with hydrogens summed into heavy atoms:
elementType: O O O N N C C C C C C C
charge: -0.257196 -0.243961 -0.254923 -0.027237 0.066137 0.149851 -0.017080 -0.026520 -0.014207 0.261648 0.202021 0.161468
polarizability: 1.28035768e+02 7.82032987e+00 9.50765213e+01 -6.25035952e+00 6.91734382e-01 8.60993687e+01
1716.lowfreq: -12.0233 -5.2265 -0.0007 -0.0007 -0.0006 9.1643 23.8863 42.2239 52.1644
frequency: 23.5092 42.2204 52.1516 84.8796 110.3300 154.8433 177.0943 182.1587 226.9427 244.7503 256.4032 268.6279 298.3332 308.6901 340.2842 362.8968 380.3056 405.8336 433.0114 522.8272 571.2377 689.4020 722.8570 736.6245 812.0574 823.3911 869.4299 931.1557 934.9727 938.1666 953.2856 1014.8179 1023.3955 1031.5654 1076.1994 1109.2928 1172.2044 1205.8241 1228.5872 1260.7116 1292.4219 1314.8686 1364.2046 1371.2294 1376.8188 1381.6715 1405.1044 1422.7069 1439.5580 1452.5467 1457.4482 1464.9673 1469.6366 1474.5592 1477.5274 1478.5552 1498.2643 1624.0898 2984.1381 2985.3531 2991.9589 2998.0409 3055.4587 3077.4223 3079.7560 3080.6565 3091.1826 3095.5942 3101.3687 3105.1151 3138.6867 3147.2006
redmass: 3.1059 5.5413 4.3645 4.7936 1.2619 2.8710 1.9919 1.3346 1.9273 1.8945 1.3286 1.8603 3.3210 3.2140 3.0145 2.3969 5.3942 2.1986 3.6040 5.3087 3.3196 5.1593 6.9953 5.1126 5.6238 3.7952 4.3477 1.7447 3.2312 1.7159 1.2024 1.7456 1.4187 1.5431 3.0659 1.3347 2.0041 2.8728 2.9816 3.0876 2.8260 1.8578 2.5108 1.1908 1.3899 1.2648 1.2074 1.1223 1.1543 1.0494 1.0519 1.0498 1.0472 1.0498 1.0613 1.0636 1.0683 9.7095 1.0348 1.0353 1.0358 1.0336 1.0586 1.1006 1.1002 1.0999 1.1000 1.1002 1.1003 1.0997 1.1024 1.1079
irintensity: 1.4505 2.3825 3.9367 3.4858 0.1487 1.6445 2.7067 2.4335 2.5721 1.4043 1.1376 1.4890 2.3031 3.8509 4.2032 0.2122 2.7014 13.4220 3.3341 8.3131 0.6215 15.3451 10.1087 13.7734 80.2313 35.5012 242.6837 2.1847 127.1117 31.8206 0.1729 142.1486 3.2436 31.5345 236.9621 5.4425 54.7395 4.8557 7.8746 7.8653 34.1233 21.3498 64.2733 23.2542 20.7524 11.6840 14.3802 28.0245 34.0987 0.0715 18.5909 0.3726 0.7791 14.0091 30.8101 15.1600 32.9286 158.2570 32.4539 13.5207 26.3969 11.9322 19.5962 12.2827 24.5817 16.0910 45.5608 22.8352 10.2741 41.3081 0.5784 1.2611
temp: 298.150 k
press: 1.00000 atm
elementType: 8 8 8 7 7 6 6 6 6 6 6 6 1 1 1 1 1 1 1 1 1 1 1 1 1 1
symmnumber: 1
zpe: 554345.8 jmol-1
zpe.correction: 0.211139 hartree
zpe.thermalcorrener: 0.225696 hartree
zpe.thermalcorrenthalpy: 0.226640 hartree
zpe.thermalcorrgfe: 0.168765 hartree
zpe.sumelectzpe: -609.289750 hartree
zpe.sumelectthermal: -609.275193 hartree
zpe.sumelectthermalent: -609.274249 hartree
zpe.sumelectthermalfe: -609.332123 hartree
dipole: 3.1855 0.9545 -0.7925
dipole: 3.4186
quadrupole: -82.3208 -77.4758 -68.8484
quadrupole: -11.4626 5.4114 1.6653
quadrupole: -6.1058 -1.2608 7.3666 -11.4626 5.4114 1.6653
hfenergy: -609.5008887 hartree
pointgroup: C01 [X(C7H14N2O3)]
dipole: -1.1829123 0.6398721 -0.014688 debye
dipolederiv: -1.7548197 0.2400005 -0.2005254 -0.0738513 -0.3722619 0.0933819 -0.3458097 0.0599038 -0.5399444 -0.7098585 -0.117084 0.1302709 0.0672317 -0.5309603 0.338875 -0.17582 0.320583 -0.692332 -0.7196772 0.3847241 -0.113636 0.5973829 -0.6206294 0.1237987 0.4765011 -0.3827074 -0.2160169 -0.8864202 0.3526524 0.0046498 0.6164308 -0.6807616 -0.0560186 -0.1220791 0.1660966 -0.2472246 0.8951067 -0.7696091 0.1965191 -1.0193139 0.7327628 -0.2155983 0.1215336 -0.0676839 -0.000641 -0.0006732 -0.0766803 0.0612855 -0.1241899 0.0089213 0.0642045 0.0845177 0.0759698 0.0328195 -0.0149514 0.0023244 0.0008951 -0.0407053 0.0502201 -0.0015555 -0.0782509 -0.0301757 -0.015277 -0.0198642 0.0351017 -0.0441443 -0.0016325 0.0293766 0.0212302 -0.0151531 0.0172345 -0.0202917 -0.0614348 0.0053503 -0.0009423 0.083399 -0.0022656 -0.0062596 -0.0011282 0.0119261 0.0395463 1.5510117 0.1106671 0.1052652 -0.0656061 0.5131297 -0.5213774 0.6022436 -0.544987 0.8544998 1.4702645 -0.235717 -0.1774147 -0.0290349 0.5149853 0.1602029 -0.5141202 0.2708029 0.3149634 0.1241031 0.0840772 -0.0146659 0.0944923 0.1129042 0.0070607 -0.1152698 0.0547553 0.1268929 0.1034452 0.0182005 0.012276 0.0418742 -0.1604484 -0.0513438 0.0034833 0.0060776 0.0645431 0.0204323 0.0474126 -0.1233498 0.0562518 0.0722933 0.0487332 -0.1005195 0.0246959 -0.0166596 -0.1239095 -0.0811123 0.0831564 -0.105665 0.0531445 0.0252248 0.0664828 0.0008167 0.0557819 0.0897341 0.0269042 0.061519 0.0309436 0.0704556 -0.0676669 0.0128918 -0.0542485 -0.1210151 -0.132805 -0.0685873 0.0277419 -0.1110654 0.0493251 0.029779 0.0671398 0.0419116 0.071161 0.097425 0.0097301 -0.0134534 0.0598841 -0.144467 0.0040366 -0.017622 -0.0229352 0.0820872 -0.1150583 -0.1058296 0.0604176 -0.0951341 0.0253215 0.0178974 0.0647428 0.0295584 0.0883163 0.0959637 0.0281897 0.0555619 0.0241887 0.0365105 -0.0424417 0.0538111 -0.0962568 -0.123043 0.0124406 0.0754882 -0.0985614 0.0675711 0.0499301 0.0205887 -0.1045785 0.0592633 0.0096032 -0.0278075 0.0672237 0.0179638 -0.0411646 -0.0224324 0.011087 0.0992585 0.0819015 0.0811255 -0.0053276 -0.0134012 -0.0381246 -0.0066353 0.1270091 0.022121 -0.0043993 -0.0661496 -0.0123678 0.1119279 0.0682256 -0.0711505 0.0548791 0.058596 0.0325961 -0.054707 0.0099646 0.1083695 0.077525 -0.03326 -0.0199795 -0.0631353 -0.0609017 -0.0656775 -0.0150232 0.0133407 0.0403057 -0.0767728 -0.0549914 0.0984256 -0.0173955 0.0902426 0.0071216 0.0118744 0.0203416 0.0347977 unknown
polarizability: 124.7436295|-15.0873691|91.680226|-0.9133687|-2.6898945|92.7878028 unknown
InChI: InChI=1S/C7H14N2O3/c1-7(2,3)6(10)12-5-9(4)8-11/h5H2,1-4H3
charge 0 multiplicity 1
26 atoms
O  -0.008611 -0.049257 0.760121
O  -0.800153 1.067866 -1.126263
O  3.735833 -1.961017 -0.27166
N  2.186236 -0.341131 -0.282172
N  3.041053 -1.167636 0.454862
C  -2.371249 -0.305079 0.246954
C  -2.737536 0.129554 1.696408
C  -3.453987 0.172638 -0.749321
C  -2.225391 -1.855436 0.18822
C  -1.024503 0.323818 -0.143221
C  1.35537 0.525498 0.520907
C  2.102678 -0.432626 -1.753816
H  -2.838945 1.227648 1.772173
H  -1.971675 -0.202818 2.416618
H  -3.706322 -0.322845 1.975963
H  -3.202311 -0.115819 -1.78446
H  -4.425124 -0.282698 -0.483784
H  -3.563295 1.270855 -0.725943
H  -3.189133 -2.320062 0.465218
H  -1.96307 -2.195828 -0.830244
H  -1.44904 -2.208219 0.887331
H  1.235893 1.507931 0.036104
H  1.797987 0.59227 1.524341
H  1.34195 0.280087 -2.10315
H  1.828043 -1.4591 -2.055516
H  3.086302 -0.207294 -2.201973
