program: Gaussian 09
title: 000146765
version: EM64L-G09RevD.01
frameworkgroup: C1[X(C14H11Cl2NO3)]
method: RPBEPBE
basis: SDD
operation: Freq
keyword: #p
keyword: freq=noraman
keyword: PBEPBE/SDD
title: #p freq=noraman PBEPBE/SDD
converged: YES YES NO NO
title: Mulliken charges:
elementType: Cl Cl O O O N C C C C C C C C C C C C C C H H H H H H H H H H H
charge: 0.002155 -0.056915 -0.330732 -0.418018 -0.215702 -0.679640 0.374665 0.205087 -0.626845 0.279267 -0.373985 -0.318993 0.396036 -0.246576 -0.236834 -0.235553 -0.403714 -0.297020 -0.062791 0.208154 0.260728 0.251059 0.235063 0.261736 0.230159 0.230494 0.254171 0.281581 0.339986 0.315745 0.377233
chargesum: 0.00000
title: Mulliken charges with hydrogens summed into heavy atoms:
elementType: Cl Cl O O O N C C C C C C C C C C C C C C
charge: 0.002155 -0.056915 -0.330732 -0.040785 -0.215702 -0.023909 0.374665 0.205087 -0.115059 0.279267 -0.138923 -0.057258 0.396036 -0.016417 -0.006340 -0.235553 -0.149543 -0.015438 -0.062791 0.208154
polarizability: 2.46497131e+02 8.17435542e+00 1.56159191e+02 -1.49157288e+00 4.78223676e+00 1.56040783e+02
1716.lowfreq: -0.0032 -0.0027 -0.0024 2.9780 4.6769 8.6455 15.3460 23.0620 29.0048
frequency: 14.9392 23.0282 28.9402 41.0790 41.5454 83.4054 114.9874 150.0528 154.3852 168.2995 196.1069 215.3441 241.0006 271.2707 308.1389 316.7655 337.6481 362.2418 386.6732 399.0931 446.9592 451.8768 478.1391 488.2551 511.1080 517.3735 528.3342 545.6963 561.6809 569.6106 595.4729 623.4908 652.1827 678.5143 723.1862 742.0406 756.8531 770.6823 810.5997 819.2358 837.1803 846.6564 865.8985 876.6555 923.4094 927.1828 946.0196 980.9521 1021.6169 1038.1915 1049.7092 1094.1026 1097.5135 1161.0437 1168.8960 1173.6679 1186.3389 1198.9853 1221.5237 1252.4096 1292.7415 1298.8921 1339.2821 1383.5112 1390.4462 1429.5008 1433.9736 1442.7822 1479.1892 1483.4151 1564.1482 1599.3535 1603.9868 1616.2920 1631.8730 1678.0689 3007.6990 3078.3646 3127.9949 3138.9528 3155.2115 3164.4588 3169.9866 3196.5144 3513.5588 3562.7961 3708.3677
redmass: 7.7139 7.8052 8.1724 11.4783 8.3400 5.8994 6.3815 5.5169 8.1756 6.3956 5.8270 4.0683 7.9042 4.6424 5.6278 5.3602 5.8486 2.8340 7.9369 1.4301 3.2904 4.5099 1.1793 2.8786 5.1218 3.6971 3.6923 4.0957 4.7786 5.0453 4.6679 2.5289 1.9506 5.5862 4.5277 5.4680 1.4550 4.5287 1.4171 4.3575 1.5868 2.5122 4.6675 2.0970 2.2006 7.9829 1.4267 1.3191 1.7667 2.3390 2.2935 2.1514 1.7227 2.2725 2.1641 1.3628 1.1682 1.7513 2.1253 1.7006 1.4600 2.3329 1.9151 7.1764 8.1982 3.8868 1.4498 1.5750 4.4575 3.0377 7.7703 5.9311 2.5080 7.0766 1.8198 8.5420 1.0630 1.0968 1.0873 1.0888 1.0935 1.0927 1.1006 1.0937 1.0639 1.0448 1.1043
irintensity: 0.1034 0.5746 0.2462 1.0752 0.4672 1.7077 1.2074 0.5008 0.7611 0.3696 0.3655 1.1318 1.2243 4.6188 6.0621 9.2984 15.1970 34.8388 5.3193 86.2339 4.7532 9.5421 108.2080 9.7404 7.8221 9.1607 6.2493 49.3144 3.2612 0.8708 5.1907 67.3076 97.6043 6.9427 9.1184 24.3685 65.4774 55.9078 20.7232 5.3292 43.1123 4.7974 17.5378 1.5731 7.6740 73.3121 4.4275 0.0202 16.3252 32.9922 280.1567 37.8590 18.6410 10.8145 190.3277 72.3364 4.6820 34.5953 57.9257 2.1092 2.4455 12.5190 53.9867 41.9210 7.3827 50.8489 21.5140 38.8596 161.8849 39.5822 69.2150 41.1006 29.3444 14.0598 325.7509 175.0287 14.3374 3.2793 6.4117 9.2128 17.4398 2.2629 18.7789 2.9688 23.2696 80.6895 42.6953
temp: 298.150 k
press: 1.00000 atm
elementType: 17 17 8 8 8 7 6 6 6 6 6 6 6 6 6 6 6 6 6 6 1 1 1 1 1 1 1 1 1 1 1
symmnumber: 1
zpe: 577111.8 jmol-1
zpe.correction: 0.219810 hartree
zpe.thermalcorrener: 0.238703 hartree
zpe.thermalcorrenthalpy: 0.239647 hartree
zpe.thermalcorrgfe: 0.169204 hartree
zpe.sumelectzpe: -1739.213214 hartree
zpe.sumelectthermal: -1739.194321 hartree
zpe.sumelectthermalent: -1739.193377 hartree
zpe.sumelectthermalfe: -1739.263820 hartree
dipole: 0.9183 2.7038 3.5862
dipole: 4.5841
quadrupole: -129.3485 -119.4734 -122.6485
quadrupole: -0.4545 0.9050 1.4026
quadrupole: -5.5250 4.3500 1.1750 -0.4545 0.9050 1.4026
hfenergy: -1739.433024 hartree
pointgroup: C01 [X(C14H11Cl2N1O3)]
dipole: -0.272859 0.9564261 -1.5045124 debye
polarizability: 243.9681961|-17.1075218|157.7761967|-1.4507136|-4.5594552|156.9527121 unknown
InChI: InChI=1S/C14H11Cl2NO3/c15-9-6-10(16)14(11(17)7-9)20-12-4-2-1-3-8(12)5-13(18)19/h1-4,6-7,18H,5,17H2
charge 0 multiplicity 1
31 atoms
Cl 0.460816 -1.542456 2.031802
Cl 5.704314 -0.805391 0.349689
O  -0.211028 -0.183224 -0.638409
O  -3.049525 -2.79809 -1.041798
O  -3.133357 -1.772367 1.039867
N  1.595036 0.787184 -2.479587
C  -2.380932 0.778411 -0.27006
C  -0.982942 0.867685 -0.049178
C  -2.961752 -0.395443 -1.031589
C  1.170823 -0.281514 -0.341656
C  -3.194316 1.804097 0.260783
C  -0.403517 1.930033 0.67211
C  2.089558 0.187784 -1.332632
C  -2.639054 2.881698 0.988382
C  -1.242815 2.939883 1.193514
C  1.650278 -0.921417 0.816141
C  3.48523 0.020076 -1.105265
C  3.029144 -1.093298 1.058892
C  3.912253 -0.605066 0.076251
C  -3.04108 -1.673865 -0.198849
H  -2.37871 -0.6307 -1.937513
H  -3.993728 -0.164693 -1.358821
H  -4.278803 1.74869 0.109495
H  0.678664 1.965583 0.831832
H  -3.289743 3.662538 1.394939
H  -0.801485 3.767098 1.759857
H  4.212409 0.37053 -1.843231
H  3.387137 -1.586994 1.963557
H  0.589604 0.830182 -2.624491
H  2.218637 1.133278 -3.201789
H  -3.127515 -3.61933 -0.484044
