program: Gaussian 09
title: 000146761
version: EM64L-G09RevD.01
frameworkgroup: C1[X(C11H9Cl2NO2)]
method: RPBEPBE
basis: SDD
operation: Freq
keyword: #p
keyword: freq=noraman
keyword: PBEPBE/SDD
title: #p freq=noraman PBEPBE/SDD
converged: YES YES NO NO
title: Mulliken charges:
elementType: Cl Cl O O N C C C C C C C C C C C H H H H H H H H H
charge: -0.043713 -0.041324 -0.186193 -0.203970 -0.157754 -0.378732 -0.558858 0.153777 0.597220 0.178849 -0.436175 -0.356291 -0.602358 -0.079062 -0.063444 -0.239710 0.273916 0.275163 0.281065 0.263840 0.263907 0.255350 0.254862 0.263544 0.286093
chargesum: 0.00000
title: Mulliken charges with hydrogens summed into heavy atoms:
elementType: Cl Cl O O N C C C C C C C C C C C
charge: -0.043713 -0.041324 -0.186193 -0.203970 -0.157754 -0.104816 -0.002630 0.153777 0.597220 0.178849 -0.172335 -0.092385 0.171398 -0.079062 -0.063444 0.046383
polarizability: 1.88712710e+02 -1.61021036e+01 1.51712353e+02 8.07586564e+00 -3.63592648e-01 1.01362752e+02
1716.lowfreq: -8.9742 -4.6372 -0.0023 -0.0019 -0.0004 3.2258 6.5833 22.0232 60.7326
frequency: 2.6429 21.9377 60.7228 68.1876 114.5067 140.0453 153.8363 166.6345 197.3297 219.2197 244.3503 263.9364 276.3255 357.8529 370.0910 404.0921 410.1404 515.9043 517.2087 527.7223 546.6819 577.5647 617.1261 651.9130 675.1560 685.4865 749.9204 778.6021 848.2838 865.3989 881.2178 887.3886 939.1028 971.0120 983.2096 1038.1381 1050.0965 1096.0425 1107.6236 1109.9229 1127.8253 1155.4981 1214.5321 1226.0478 1255.7739 1261.4075 1273.3227 1296.8842 1346.2981 1377.5487 1422.1632 1431.9048 1434.8325 1448.2054 1470.8762 1481.6884 1570.2647 1598.3879 1632.6040 1698.2077 3007.1023 3028.4299 3034.7091 3089.4767 3101.2296 3125.7431 3152.0953 3163.6181 3188.0663
redmass: 9.5974 5.6691 5.3799 1.0902 7.9106 4.9324 10.3200 10.1277 4.6334 4.1826 5.6277 3.2066 4.0091 8.3619 11.9933 5.5226 9.2961 4.7851 5.2663 4.7405 3.0148 9.9424 3.9571 5.8429 5.5004 2.4594 8.6375 4.6090 3.9376 1.4838 1.6613 1.3779 2.5115 2.6502 5.2820 3.9137 4.8998 1.4941 2.7069 2.0349 1.3296 1.2127 2.0079 1.3790 1.4267 2.6366 1.4770 1.7295 5.3139 7.7262 2.3406 1.4405 2.3840 1.1157 1.0419 1.0714 7.0072 7.4582 12.0933 11.2501 1.0327 1.0718 1.0740 1.1016 1.1022 1.1024 1.0927 1.0932 1.0940
irintensity: 0.0542 0.1923 0.0810 0.0285 10.0466 2.1218 0.2716 1.9520 0.0341 0.1537 1.5083 3.5538 3.9987 21.7568 8.9774 3.6109 7.0511 1.4697 0.0645 2.3548 0.3041 3.3015 1.7128 42.3584 4.0017 30.9790 67.9981 22.2698 15.6360 31.0461 5.9104 0.4781 28.8264 4.1171 3.1566 59.4741 4.1413 8.2641 101.3610 35.6630 0.0942 1.4745 15.9307 13.9809 26.3576 74.4788 8.8943 1.1621 150.0728 0.2351 63.8733 85.8811 7.0286 14.2341 18.8337 13.9952 115.5987 74.4702 602.6487 34.1886 21.3223 6.9679 4.5811 4.1657 13.5989 0.6047 1.2414 0.7224 1.6048
temp: 298.150 k
press: 1.00000 atm
elementType: 17 17 8 8 7 6 6 6 6 6 6 6 6 6 6 6 1 1 1 1 1 1 1 1 1
symmnumber: 1
zpe: 464793.0 jmol-1
zpe.correction: 0.177030 hartree
zpe.thermalcorrener: 0.192123 hartree
zpe.thermalcorrenthalpy: 0.193068 hartree
zpe.thermalcorrgfe: 0.129952 hartree
zpe.sumelectzpe: -1548.772156 hartree
zpe.sumelectthermal: -1548.757063 hartree
zpe.sumelectthermalent: -1548.756119 hartree
zpe.sumelectthermalfe: -1548.819235 hartree
dipole: -0.7468 -0.9975 -1.1125
dipole: 1.6704
quadrupole: -111.9957 -108.2499 -112.1506
quadrupole: 5.6272 -7.1700 8.0912
quadrupole: -1.1969 2.5489 -1.3519 5.6272 -7.1700 8.0912
hfenergy: -1548.9491864 hartree
pointgroup: C01 [X(C11H9Cl2N1O2)]
dipole: 0.2979605 -0.3816337 0.4443842 debye
dipolederiv: -0.1569363 0.0844854 -0.0188867 0.1461808 -0.7752706 0.1063742 -0.0312269 0.1054458 -0.0748621 -0.6003531 -0.3435804 -0.0040265 -0.3635825 -0.3983787 0.0118174 -0.0096596 0.0110747 -0.0609391 -0.5841311 -0.0896104 -0.0701956 -0.1699831 -0.4596062 -0.2216184 -0.1164521 -0.3516297 -0.9266479 -0.9462756 -0.2745574 -0.3492668 -0.3570013 -0.5076273 -0.2705781 -0.1754273 -0.1578343 -0.6863327 -1.0331545 -0.3523161 -0.2543967 -0.4941429 -0.4510084 -0.3824792 -0.2380941 -0.3907507 -1.1327695 -0.2287344 -0.0130994 0.175363 -0.1238172 0.1236864 0.002616 0.2295219 -0.0431421 -0.1274318 -0.2843348 -0.0914687 0.1327965 -0.0407629 0.0347906 0.0264796 0.2419595 0.0062028 -0.0910352 1.3272456 0.4773615 0.3159931 0.6536483 0.5234395 0.4310356 -0.0971066 0.4711283 1.0617907 0.5092513 -0.0314514 -0.0208111 -0.0710196 0.1855322 -0.0273018 0.0626842 -0.0273706 -0.0587005 1.0346742 0.3639938 0.227515 0.5199688 0.473915 0.458236 0.3098222 0.4739167 1.4851288 -0.4881315 -0.1141241 -0.0121311 -0.0962763 -0.1174047 -0.0050276 -0.0338273 0.0157136 -0.1059388 -0.2570603 0.1182813 -0.0137407 0.1885099 -0.3803158 0.0398625 -0.0426891 0.0443396 -0.1129943 0.2601507 -0.0268235 -0.1672877 -0.0321053 0.1752349 -0.093611 -0.1538268 -0.0455728 0.1936667 0.3321566 -0.0949523 0.0408259 -0.2306672 1.2090828 -0.1844951 0.0703295 -0.1824994 -0.0111606 0.9473558 0.482978 0.0330137 0.5419944 0.6539688 -0.0424622 0.0352609 -0.0403945 -0.0169515 -0.2716591 -0.1388932 0.0119025 -0.1226966 -0.5112914 0.045886 0.0018532 0.0407403 -0.0936572 0.0521504 -0.0473505 0.0002354 0.006276 -0.0669312 0.0120412 -0.0006166 0.0142386 0.0578379 0.0269599 0.009797 -0.0449236 0.0035775 0.0489271 0.0916593 -0.0672874 0.0502008 0.0156784 0.0707967 0.0392968 0.0545392 0.0425185 -0.004097 -0.0636845 0.0482536 -0.0297439 0.0996057 0.1047165 0.0398341 -0.0154476 0.0315305 -0.0135347 0.0265779 -0.0137682 0.0203114 0.1450442 0.0119119 -0.0691956 -0.0086906 -0.0923486 0.0687774 0.0046603 -0.0024469 0.0019894 0.1364011 0.0398493 0.0747366 -0.046019 0.0229772 0.041266 0.0843372 0.0188954 0.0833924 -0.0168466 0.0663785 0.0114532 0.051267 0.0869946 -0.0460855 -0.0571316 0.0776091 -0.0285244 0.0507655 0.0289439 -0.0415102 0.0005371 -0.0759847 0.0933213 -0.0060903 -0.0949096 -0.0537657 0.0990404 0.0382295 0.0267155 -0.0181647 0.0262116 0.0996097 0.0128965 -0.0188507 0.0125336 0.1713086 unknown
polarizability: 188.2789524|16.6882328|152.1224009|7.9428728|-0.3282302|101.3864615 unknown
InChI: InChI=1S/C11H9Cl2NO2/c1-14-10(15)5-9(11(14)16)6-2-7(12)4-8(13)3-6/h2-4,9H,5H2,1H3
charge 0 multiplicity 1
25 atoms
Cl -2.409862 3.264005 -0.396083
Cl -4.495264 -1.861981 0.066049
O  1.327773 -1.30077 -1.909112
O  3.819508 0.875401 1.406639
N  2.775494 -0.130884 -0.460661
C  0.738147 -0.949738 0.512341
C  1.584037 -0.231049 1.601083
C  1.597508 -0.840848 -0.777099
C  -0.666645 -0.392579 0.297224
C  2.857185 0.252791 0.902035
C  -1.780969 -1.264547 0.285275
C  -0.862732 0.997195 0.087052
C  3.827283 0.153771 -1.445181
C  -2.165077 1.480937 -0.123447
C  -3.067643 -0.733977 0.07209
C  -3.295104 0.639166 -0.13523
H  0.651195 -2.028013 0.737056
H  1.864749 -0.899887 2.432342
H  1.063817 0.632532 2.048787
H  -1.64764 -2.340278 0.432735
H  -0.01673 1.692008 0.078095
H  3.428592 0.780514 -2.260275
H  4.205188 -0.786287 -1.880298
H  4.63972 0.68442 -0.924069
H  -4.300231 1.033998 -0.299346
