program: Gaussian 09
title: 000146789
version: EM64L-G09RevD.01
frameworkgroup: C1[X(C22H30N4O3)]
method: RPBEPBE
basis: SDD
operation: Freq
keyword: #p
keyword: freq=noraman
keyword: PBEPBE/SDD
title: #p freq=noraman PBEPBE/SDD
converged: YES YES NO NO
title: Mulliken charges:
elementType: O O O N N N N C C C C C C C C C C C C C C C C C C C C C C H H H H H H H H H H H H H H H H H H H H H H H H H H H H H H
charge: -0.480987 -0.300104 -0.299297 -0.111352 -0.425576 -0.063178 -0.703881 -0.094401 -0.421621 -0.379746 0.284640 -0.318799 -0.323704 0.323826 0.222344 -0.105426 -0.044883 -0.527980 -0.671878 -0.664418 -0.294509 -0.523823 -0.582530 0.155044 0.235302 0.553309 -0.507855 -0.530004 -0.529290 0.198681 0.241568 0.182820 0.264290 0.217048 0.342104 0.193133 0.199684 0.202411 0.187761 0.230076 0.208076 0.224156 0.213267 0.210466 0.227235 0.229848 0.345487 0.247792 0.283213 0.254231 0.214180 0.304556 0.309702 0.215219 0.256265 0.225327 0.225945 0.224057 0.252179
chargesum: 0.00000
title: Mulliken charges with hydrogens summed into heavy atoms:
elementType: O O O N N N N C C C C C C C C C C C C C C C C C C C C C C
charge: -0.135500 -0.300104 -0.299297 -0.111352 -0.083471 -0.063178 -0.089624 0.104280 0.002766 0.101592 0.284640 0.074017 0.066469 0.323826 0.222344 -0.105426 -0.044883 -0.297903 -0.026379 0.003131 -0.046717 -0.240610 -0.328299 0.155044 0.235302 0.553309 -0.293675 0.166806 0.172891
polarizability: 4.01900424e+02 8.21265610e+01 3.61351950e+02 3.29953243e+01 -3.05755247e+01 2.01362806e+02
1716.lowfreq: -9.0161 -6.9568 -5.0588 -0.0004 -0.0004 0.0003 14.1423 14.9252 20.5957
frequency: 13.5876 13.9454 20.3827 35.2808 47.9201 58.5614 66.1837 72.8528 89.1301 89.7549 104.0176 114.3318 129.7648 154.2824 160.1265 163.4402 163.8722 169.3095 195.2612 205.5322 211.1546 227.5820 237.3491 260.2048 261.6408 278.4592 288.3392 290.3350 302.6644 312.2280 330.4451 334.7608 341.2515 350.0306 368.3064 381.3089 390.9042 406.6238 427.3480 446.7895 455.7516 462.3862 471.1169 477.2770 497.0539 510.7182 565.5053 577.9511 601.1258 626.4551 636.3495 650.6299 667.0126 698.0274 707.9817 722.0926 729.7634 743.2531 750.3802 776.2049 781.1834 793.9552 795.3196 805.6680 834.7749 871.8845 873.5775 880.7243 899.9508 901.1416 910.6230 930.8486 943.2723 952.7231 963.0089 971.7559 995.1968 1039.2115 1045.3628 1056.9029 1071.9071 1073.4946 1084.6252 1087.0107 1091.5042 1112.6739 1113.5629 1116.0867 1137.4912 1145.0298 1155.0112 1158.2332 1169.8169 1180.5259 1186.5362 1204.7552 1208.0243 1235.3985 1250.5250 1252.5515 1266.4359 1277.4274 1288.1946 1291.6041 1293.6699 1303.9423 1334.9321 1346.7325 1357.3850 1363.2111 1372.5149 1376.2511 1382.0814 1387.1085 1387.3348 1394.9384 1420.3146 1424.5631 1434.6501 1452.2406 1452.7928 1457.4364 1458.4573 1461.4363 1466.3531 1468.7157 1473.0079 1476.0213 1478.7441 1480.3897 1482.7103 1486.5153 1486.6497 1490.6961 1504.2586 1518.7126 1548.8259 1561.9466 1618.1944 1638.9096 1649.7580 2825.1644 2857.8170 2868.1247 2960.9529 2965.9167 2969.9618 2979.6923 2985.1975 2989.7773 3018.8223 3036.3167 3053.0474 3064.3329 3067.0120 3075.5332 3078.8963 3082.2507 3091.2745 3094.9626 3116.0293 3117.9583 3120.4741 3128.3798 3145.2499 3172.0203 3175.2020 3506.8696 3565.7208 3571.7857 3707.1297
redmass: 4.4446 4.4338 3.3852 4.2060 3.5582 4.2663 3.0184 3.4290 2.1034 3.5002 2.7801 4.2511 4.0720 2.6416 1.6460 1.3761 1.3170 2.1636 3.9441 2.7315 1.5153 3.3189 2.0773 2.6762 3.1924 4.1569 5.2825 1.7500 1.9583 3.3654 3.1585 3.8374 1.2718 2.7109 2.4885 3.6816 4.7613 1.1710 2.3654 3.8175 2.8544 4.3547 3.2412 4.3802 3.4066 4.5989 6.7855 4.8381 2.0224 4.1797 3.4134 6.2362 2.3714 5.3709 4.9653 5.3524 2.8358 5.6924 2.6065 2.4653 5.3731 1.1837 1.2150 2.1727 2.9795 1.6817 1.8101 3.7720 1.7657 1.9013 2.2826 6.3247 1.5941 2.7985 2.8786 2.4231 2.1567 2.0559 1.6654 2.7846 2.6401 1.8378 2.1165 2.4446 3.4240 1.7349 1.3475 1.2510 1.7244 1.4821 1.6349 1.5247 1.7728 2.3011 1.5831 2.2833 1.4984 1.7316 1.8087 1.4956 1.2360 1.1471 3.7588 1.3504 2.5883 1.3743 1.9833 1.5546 1.3923 1.3322 2.0414 2.0105 1.5996 3.1335 1.4655 1.2316 1.2415 1.6629 1.8298 2.2379 1.0935 1.1887 1.1236 1.0507 2.7578 1.0757 1.3194 1.1157 1.0600 1.0643 2.1273 1.0720 1.0722 1.0741 4.8377 4.2378 7.3652 4.0518 6.4346 1.4342 3.3566 1.0717 1.0720 1.0713 1.0712 1.0317 1.0308 1.0809 1.0358 1.0363 1.0873 1.0872 1.0869 1.1024 1.1040 1.0952 1.0986 1.0979 1.1004 1.1002 1.1029 1.1026 1.0888 1.0900 1.0914 1.0929 1.0921 1.0744 1.0448 1.0661 1.1040
irintensity: 0.6287 0.2586 0.4067 1.2097 0.2289 4.4112 0.0361 0.8137 0.0766 3.5072 9.3043 3.7542 3.2929 1.8560 2.1493 0.6324 1.7268 0.7106 8.9846 1.3502 0.7105 12.9257 1.7134 10.0594 12.8982 2.8787 5.6692 16.6239 62.4058 31.1884 31.0570 38.2384 162.8022 1.1503 7.4533 1.1224 8.2384 108.7653 11.1274 7.1335 0.2457 4.8148 2.8531 11.5563 3.4133 9.7672 7.1723 8.5818 66.6925 3.8995 21.9063 15.6538 54.3536 8.5614 1.2858 14.1980 4.6760 7.4172 11.8157 23.1082 3.3998 3.4171 7.8843 24.2020 4.1664 54.1300 11.2809 13.3901 23.6871 4.7140 20.9012 44.1851 3.2349 43.9849 76.3337 6.4555 2.8283 53.6621 29.7102 7.2981 49.2383 12.3120 0.3033 6.1608 73.8640 28.6156 14.8146 4.4396 14.5219 43.3190 2.2293 16.4353 71.2561 7.3572 59.2061 22.0142 138.6919 124.8964 10.0136 55.3387 11.1218 9.5919 74.0538 8.0243 6.0106 1.5927 23.1603 7.0038 18.9073 1.1492 32.9592 2.0191 12.5813 29.3050 53.6742 10.3326 14.5499 5.7705 21.6016 29.2182 1.1978 12.2992 50.6062 7.3735 313.5681 13.4091 132.1794 31.4998 3.8000 7.8573 84.6717 17.4640 21.8262 17.0604 61.5731 137.3281 179.5024 45.0421 187.3416 9.9537 532.1149 77.7574 32.6584 200.6776 21.6785 93.9203 100.0140 110.8273 27.4216 16.7241 21.1580 20.1091 23.5733 31.3922 23.7844 9.0725 48.4688 42.0211 45.4131 22.4482 30.3559 33.4997 18.3196 8.4928 16.5362 19.4223 2.3263 83.6704 122.2746 5.5763 20.0693
temp: 298.150 k
press: 1.00000 atm
elementType: 8 8 8 7 7 7 7 6 6 6 6 6 6 6 6 6 6 6 6 6 6 6 6 6 6 6 6 6 6 1 1 1 1 1 1 1 1 1 1 1 1 1 1 1 1 1 1 1 1 1 1 1 1 1 1 1 1 1 1
symmnumber: 1
zpe: 1281990.6 jmol-1
zpe.correction: 0.488284 hartree
zpe.thermalcorrener: 0.518776 hartree
zpe.thermalcorrenthalpy: 0.519721 hartree
zpe.thermalcorrgfe: 0.425037 hartree
zpe.sumelectzpe: -1298.797818 hartree
zpe.sumelectthermal: -1298.767326 hartree
zpe.sumelectthermalent: -1298.766382 hartree
zpe.sumelectthermalfe: -1298.861066 hartree
dipole: 4.8721 -3.1894 -0.1399
dipole: 5.8249
quadrupole: -151.3037 -140.2414 -179.0116
quadrupole: 12.1021 -0.5386 1.3259
quadrupole: 5.5485 16.6109 -22.1594 12.1021 -0.5386 1.3259
hfenergy: -1299.2861025 hartree
pointgroup: C01 [X(C22H30N4O3)]
dipole: -2.0071766 -1.1058915 0.0032403 debye
polarizability: 391.5013125|-85.4797042|362.036049|12.8530962|56.3099761|211.0778188 unknown
InChI: InChI=1S/C22H30N4O3/c1-5-26(6-2)13-15(27)12-24-22-16-8-7-14(23)9-18(16)25-19-11-21(29-4)20(28-3)10-17(19)22/h7-11,15,24,27H,5-6,12-13,23H2,1-4H3
charge 0 multiplicity 1
59 atoms
O  -1.67531 -2.581841 -2.74607
O  3.668701 -2.575225 -1.039573
O  5.232119 -0.755782 0.610938
N  -3.184398 -2.350888 0.73008
N  -0.868704 -0.248423 -1.68356
N  1.449711 2.209888 0.979119
N  -2.089643 5.49108 1.344893
C  -2.54663 -2.049861 -1.673303
C  -2.208718 -2.719909 -0.31868
C  -2.311751 -0.524313 -1.667536
C  -0.139657 0.584184 -0.843236
C  -4.418738 -3.184465 0.683625
C  -2.588733 -2.276978 2.095975
C  1.20558 0.196276 -0.478472
C  -0.647204 1.824877 -0.328774
C  1.955958 1.066447 0.416893
C  0.176328 2.580199 0.616654
C  1.813476 -1.027815 -0.913918
C  -5.652714 -2.467605 1.263534
C  -1.69351 -1.043161 2.308581
C  -1.894414 2.414408 -0.737289
C  3.312616 0.711959 0.739708
C  -0.335344 3.793068 1.179006
C  3.118543 -1.358932 -0.56064
C  3.897552 -0.448917 0.250051
C  -1.583651 4.309481 0.80198
C  -2.353124 3.61037 -0.201374
C  4.005812 -3.551075 0.022925
C  6.175585 -0.803977 -0.530606
H  -3.610992 -2.237406 -1.927243
H  -1.198083 -2.393257 -0.01615
H  -2.156756 -3.831166 -0.469373
H  -2.779785 -0.127657 -0.751163
H  -2.818896 -0.083966 -2.549864
H  -0.355323 -0.953472 -2.219531
H  -4.265073 -4.160703 1.209776
H  -4.622637 -3.432736 -0.375256
H  -3.425158 -2.231433 2.816662
H  -2.016761 -3.209204 2.334344
H  1.272084 -1.762819 -1.520705
H  -6.546743 -3.114175 1.186836
H  -5.84389 -1.530331 0.712422
H  -5.516646 -2.210987 2.329276
H  -1.322475 -1.017496 3.349848
H  -2.261044 -0.115972 2.116967
H  -0.809697 -1.038905 1.646178
H  -1.687773 -3.571287 -2.723977
H  -2.484318 1.941287 -1.526132
H  3.885743 1.391453 1.375827
H  0.307688 4.312947 1.897038
H  -3.298695 4.043268 -0.550981
H  -2.984788 5.863177 1.042777
H  -1.557974 6.01281 2.035458
H  3.086173 -3.873674 0.548729
H  4.717231 -3.114778 0.746875
H  4.460473 -4.408414 -0.497318
H  7.144352 -1.098505 -0.098555
H  6.258963 0.197498 -0.9940
H  5.845666 -1.541867 -1.284197
