program: Gaussian 09
title: 000146806
version: EM64L-G09RevD.01
frameworkgroup: C1[X(C20H25NO3)]
method: RPBEPBE
basis: SDD
operation: Freq
keyword: #p
keyword: freq=noraman
keyword: PBEPBE/SDD
title: #p freq=noraman PBEPBE/SDD
converged: NO YES NO NO
title: Mulliken charges:
elementType: O O O N C C C C C C C C C C C C C C C C C C C C H H H H H H H H H H H H H H H H H H H H H H H H H
charge: -0.275120 -0.397060 -0.175190 -0.027379 0.366013 0.291447 -0.087534 -0.116663 -0.155612 -0.388076 -0.577442 -0.485343 0.312011 -0.527691 -0.653317 -0.524325 -0.831702 -0.540195 0.153654 0.042483 0.282122 -0.510336 -0.796827 -0.274322 0.224743 0.230331 0.223854 0.214204 0.225721 0.233732 0.226462 0.212477 0.222212 0.221399 0.235583 0.259265 0.221777 0.228951 0.229254 0.246054 0.220674 0.232343 0.216695 0.249201 0.249111 0.246339 0.231804 0.227979 0.366240
chargesum: 0.00000
title: Mulliken charges with hydrogens summed into heavy atoms:
elementType: O O O N C C C C C C C C C C C C C C C C C C C C
charge: -0.275120 -0.030820 -0.175190 -0.027379 0.366013 0.291447 0.137209 0.113667 0.068242 -0.173872 -0.117989 -0.046404 0.312011 -0.084080 -0.158469 -0.073597 -0.135720 -0.091157 0.153654 0.042483 0.282122 -0.012024 -0.090704 -0.274322
polarizability: 2.27951308e+02 -6.81311673e+00 2.31082475e+02 3.95483672e+00 8.52231522e+00 1.87443152e+02
1716.lowfreq: 0.0004 0.0005 0.0008 4.3291 9.4132 20.7331 34.6774 44.5898 56.1981
frequency: 34.5611 44.5522 56.1017 70.5900 105.7692 127.9988 145.0684 159.0299 178.2015 191.0431 198.7174 223.0393 231.9077 241.7281 257.5043 261.7969 273.7983 279.4747 287.6554 301.1992 304.5676 324.4081 335.9881 362.2651 371.3959 406.3217 412.2179 428.2041 439.2739 462.3200 483.4118 514.1406 526.4258 532.2516 552.6041 569.1935 575.0297 590.4611 635.2959 647.2291 656.2369 670.2417 703.3832 735.1555 776.4171 793.7892 816.7259 824.3887 829.0280 848.6398 866.8452 890.4714 911.8895 936.1442 939.0455 947.3227 968.4340 985.7093 998.2077 1004.1174 1010.0963 1015.4054 1026.8789 1046.2550 1051.0784 1067.3332 1077.3638 1087.7072 1103.8485 1113.7204 1125.3461 1136.8325 1143.7948 1164.6859 1170.0466 1179.6528 1188.3550 1197.0800 1210.1416 1216.0545 1239.4602 1239.7088 1249.5512 1253.1619 1259.5649 1265.4836 1282.7673 1288.7475 1290.9179 1304.8032 1305.0953 1320.1305 1327.8308 1329.9371 1333.4963 1336.3937 1344.2305 1352.5793 1373.1156 1385.9906 1391.2268 1413.8993 1427.6855 1459.3890 1461.7187 1465.8624 1470.1412 1473.4716 1476.1613 1484.5063 1489.0018 1490.6692 1491.4974 1657.1678 1675.7115 2161.8532 2907.3877 2928.1304 2957.0779 2970.3308 2982.3797 2986.0080 2987.9440 2991.8319 2996.8889 2997.8038 3000.3577 3003.3523 3035.8594 3041.8957 3051.6764 3054.4692 3057.3021 3060.7148 3071.4495 3071.6360 3079.6246 3082.5795 3086.3784 3086.8807 3578.1591
redmass: 6.5830 4.4304 7.2370 5.3595 3.2672 7.0592 4.7655 3.2561 2.6369 2.6208 1.5214 1.3341 2.1140 2.4620 2.5169 2.3340 1.9586 2.5549 3.1237 4.1014 2.6081 2.1454 3.6564 2.8632 2.4591 3.7648 4.4199 4.1683 4.3845 3.7162 3.8556 4.5167 3.1202 2.5246 2.7366 3.4717 4.2745 4.0959 4.6394 4.1788 4.4195 4.0001 2.8228 5.4386 3.7319 2.3839 1.9082 2.1831 2.9433 2.3974 2.0688 2.2427 2.0370 1.7516 1.8410 1.8852 1.9853 2.1082 1.8112 2.1580 1.7129 2.0659 1.7738 1.9106 2.9091 2.2011 2.9107 1.7393 2.3151 2.1388 1.9727 1.7288 2.2720 2.5201 1.8420 2.0222 1.6408 1.6322 1.7247 1.9309 1.8515 1.8634 1.6237 1.7120 1.7530 1.4479 1.8243 1.5253 1.4308 1.8135 1.3021 1.3745 1.5179 1.3940 1.4428 1.7036 1.4776 1.5185 1.4901 1.1905 1.2182 3.2681 1.0808 1.0814 1.0763 1.0883 1.0844 1.0797 1.0780 1.0589 1.0680 1.0754 1.0605 12.0562 6.9001 12.6102 1.0809 1.0810 1.0705 1.0762 1.0617 1.0452 1.0366 1.0533 1.0608 1.0596 1.0649 1.0662 1.0963 1.0980 1.1024 1.1020 1.0985 1.0892 1.0980 1.0998 1.0990 1.0992 1.0992 1.0986 1.0665
irintensity: 0.9303 0.4181 3.6844 2.6973 1.1752 1.4076 3.0219 3.6029 0.9857 3.3028 0.0242 0.2500 0.9197 6.2098 2.7691 20.4622 45.8351 21.0255 2.4875 6.8154 9.9115 13.1533 21.3329 2.4439 3.0043 1.3115 0.9246 6.9142 1.0122 2.0426 3.2112 4.6150 1.3990 0.3644 4.5467 2.1953 6.6065 1.7326 4.2993 13.9245 13.1019 2.0778 5.7093 2.6903 3.7319 4.4589 12.5669 3.1914 22.8470 13.3662 5.6240 1.9047 3.7126 5.3778 11.7740 20.6065 10.7993 6.2353 15.6233 30.8979 0.9621 12.3858 36.4028 22.4279 25.5828 0.0477 20.4081 8.2639 10.1660 18.7748 17.8748 3.6641 0.9596 44.4715 1.5534 2.7795 15.0975 3.4856 7.3427 8.8557 4.2298 13.9167 3.2450 121.5074 3.6090 1.7758 11.7051 0.2112 1.6598 9.9762 5.0290 0.0469 10.1853 0.4837 0.9661 0.3461 0.2724 0.9384 5.9428 20.7217 21.4139 36.7911 18.1957 7.7379 6.7931 9.8087 21.6615 2.0418 10.7801 5.2486 5.5452 14.7068 7.9195 183.5820 32.7315 47.3020 11.2811 9.1302 8.6887 33.1701 23.0019 12.7554 2.0181 36.4980 50.8765 5.0968 28.4465 9.1877 44.9599 25.0437 34.5595 27.6552 13.5648 43.5413 16.5662 21.4245 28.2189 16.5717 34.6922 25.8474 54.2511
temp: 298.150 k
press: 1.00000 atm
elementType: 8 8 8 7 6 6 6 6 6 6 6 6 6 6 6 6 6 6 6 6 6 6 6 6 1 1 1 1 1 1 1 1 1 1 1 1 1 1 1 1 1 1 1 1 1 1 1 1 1
symmnumber: 1
zpe: 1071959.7 jmol-1
zpe.correction: 0.408288 hartree
zpe.thermalcorrener: 0.430386 hartree
zpe.thermalcorrenthalpy: 0.431330 hartree
zpe.thermalcorrgfe: 0.359155 hartree
zpe.sumelectzpe: -1055.693285 hartree
zpe.sumelectthermal: -1055.671187 hartree
zpe.sumelectthermalent: -1055.670243 hartree
zpe.sumelectthermalfe: -1055.742417 hartree
dipole: 1.9673 -8.0070 -0.4421
dipole: 8.2569
quadrupole: -172.6210 -167.2112 -131.1072
quadrupole: 3.2895 7.1261 11.8317
quadrupole: -15.6412 -10.2314 25.8726 3.2895 7.1261 11.8317
hfenergy: -1056.1015727 hartree
pointgroup: C01 [X(C20H25N1O3)]
dipole: 0.8309573 3.1300506 0.2553509 debye
polarizability: 228.1935108|6.9690436|230.3559638|-3.6470112|9.7110067|187.9274611 unknown
InChI: InChI=1S/C20H25NO3/c1-18-7-6-14-12(13(18)3-4-15(18)22)5-8-20-17(24-20)16(23)11(10-21)9-19(14,20)2/h12-14,17,23H,3-9H2,1-2H3
charge 0 multiplicity 1
49 atoms
O  -3.238523 2.025711 -0.374875
O  -3.824285 -0.510761 2.243271
O  4.874013 -2.037487 0.552346
N  -3.671826 -3.582307 0.25278
C  -1.782396 1.638954 -0.189187
C  -1.259735 0.514386 -1.109514
C  0.056598 -0.040573 -0.430273
C  1.089667 1.09874 -0.106875
C  2.299653 0.453038 0.595092
C  -2.785588 1.278833 0.876045
C  -0.826293 2.784374 0.093698
C  0.453389 2.217584 0.753127
C  2.999145 -0.619781 -0.291081
C  0.710665 -1.207377 -1.229861
C  -2.358339 -0.590806 -1.25567
C  2.005493 -1.76383 -0.573479
C  -1.009861 1.08513 -2.532918
C  3.466747 1.323572 1.134541
C  -3.21819 -0.132218 1.042651
C  4.232675 -0.960803 0.568116
C  -2.980312 -1.058137 0.057404
C  4.559578 0.263263 1.455791
C  3.591848 -0.056337 -1.623346
C  -3.368887 -2.424483 0.193063
H  -0.253684 -0.458683 0.554773
H  1.433141 1.560688 -1.056268
H  1.893074 -0.098213 1.476035
H  -2.819096 1.905999 1.781279
H  -1.315336 3.530792 0.746116
H  -0.570499 3.300553 -0.850928
H  1.183873 3.033356 0.909812
H  0.205243 1.811745 1.756673
H  0.934675 -0.872808 -2.2611
H  -0.007433 -2.042563 -1.323228
H  -1.94296 -1.455656 -1.79817
H  -3.162349 -0.175637 -1.893258
H  1.748899 -2.268217 0.379413
H  2.460602 -2.531367 -1.226653
H  -0.822763 0.269923 -3.253733
H  -1.901348 1.639601 -2.877976
H  -0.1467 1.771161 -2.57257
H  3.184052 1.908998 2.026232
H  3.819451 2.039926 0.368661
H  4.511765 -0.06357 2.51283
H  5.59629 0.601462 1.279545
H  4.172907 -0.851075 -2.124401
H  2.798465 0.271972 -2.315418
H  4.267042 0.801949 -1.456659
H  -4.012146 0.270981 2.820345
