program: Gaussian 09
title: 000146766
version: EM64L-G09RevD.01
frameworkgroup: C1[X(C11H16N2O7)]
method: RPBEPBE
basis: SDD
operation: Freq
keyword: #p
keyword: freq=noraman
keyword: PBEPBE/SDD
title: #p freq=noraman PBEPBE/SDD
converged: YES YES NO NO
title: Mulliken charges:
elementType: O O O O O O O N N C C C C C C C C C C C H H H H H H H H H H H H H H H H
charge: -0.272373 -0.410888 -0.240022 -0.412435 -0.408236 -0.233184 -0.236070 -0.151209 -0.138446 -0.132286 -0.476774 -0.469092 -0.352762 0.149171 -0.449914 0.202487 -0.424230 -0.438031 0.193445 0.181405 0.305889 0.246081 0.235188 0.240531 0.233332 0.306857 0.227011 0.249704 0.233128 0.290061 0.234975 0.337246 0.235856 0.380036 0.382747 0.380803
chargesum: 0.00000
title: Mulliken charges with hydrogens summed into heavy atoms:
elementType: O O O O O O O N N C C C C C C C C C C C
charge: -0.272373 -0.030852 -0.240022 -0.029688 -0.027432 -0.233184 -0.236070 -0.151209 -0.138446 0.173603 0.004494 0.004771 0.181106 0.149171 0.032918 0.202487 0.100806 0.135071 0.193445 0.181405
polarizability: 1.70616004e+02 3.44434845e+00 1.45905911e+02 1.70471163e+00 9.66171957e+00 1.32300723e+02
1716.lowfreq: -8.2021 -7.5502 -5.0023 0.0008 0.0008 0.0010 22.4256 29.7094 41.5361
frequency: 22.3335 29.6280 41.5343 47.7075 51.1033 53.8788 59.1346 73.0556 94.9432 118.6268 135.1750 168.0559 177.0706 188.4796 226.4686 263.8645 273.7219 295.8557 320.6456 333.3327 355.5560 386.8745 423.4196 473.9574 497.1234 506.7253 529.6572 550.9234 570.7013 589.1051 601.1473 625.4699 626.7707 630.8935 644.0121 694.7991 708.8721 789.7182 819.4180 838.4836 867.2486 876.5739 898.9053 905.6976 920.6032 962.7767 977.2640 980.6186 995.2037 1021.4243 1040.5710 1048.7575 1053.5303 1069.4178 1102.9213 1147.0491 1151.4538 1163.3114 1168.5679 1188.0207 1236.3921 1242.3960 1243.0371 1252.8361 1254.6996 1261.4547 1273.8173 1290.8215 1303.2678 1321.2249 1343.5015 1352.3019 1360.6798 1385.5889 1388.8936 1408.4885 1430.8609 1446.1049 1466.1071 1472.3974 1475.0093 1486.9897 1574.8548 1658.1469 1669.5088 1673.9522 2872.9108 2894.3080 2928.3184 2984.2551 3019.0212 3021.0276 3021.6290 3047.0853 3050.4482 3056.7623 3085.2299 3090.7098 3101.0012 3518.2900 3520.6548 3521.1879
redmass: 6.3998 7.4974 7.3451 7.0017 8.5157 8.5845 5.5545 4.9906 5.8542 5.5729 3.9331 3.4587 4.5679 3.8399 3.0332 3.5524 2.1450 4.3542 4.9035 5.1903 3.7509 5.9743 4.3674 3.0295 2.0404 2.2932 3.5530 1.9266 3.2544 3.9371 3.1776 1.9140 1.7569 1.6350 2.6852 3.8844 5.3052 2.4309 4.8581 3.9735 3.9385 2.0554 3.9361 1.6769 2.5962 2.7270 2.2571 2.3624 2.0691 2.7720 2.4283 2.5261 2.4808 1.6648 1.9259 2.1818 1.8615 1.5963 2.0797 2.1543 1.3074 1.3488 1.3090 1.5637 1.2641 1.5886 1.7656 1.8311 1.3283 1.3378 1.4062 1.7013 1.4871 1.6129 1.5413 6.3568 1.1014 1.1404 1.0917 1.0860 1.0900 1.0945 8.1447 8.6517 8.3428 8.2500 1.0707 1.0693 1.0678 1.0675 1.0649 1.0621 1.0876 1.0914 1.0856 1.0852 1.0987 1.0996 1.1050 1.0641 1.0641 1.0642
irintensity: 1.5381 0.3097 1.7977 0.1811 1.2217 4.2708 1.7930 0.4354 4.6308 0.2182 0.7197 1.7902 6.4261 3.7041 1.6233 3.5562 1.5248 8.1480 0.7458 4.0535 1.6621 34.0957 10.2067 14.3026 47.8040 35.7512 59.9045 30.5024 21.6533 23.7510 13.2255 2.6570 117.4075 149.9935 57.1083 31.6001 20.4862 3.5133 11.1410 15.1484 0.7780 2.4639 20.9014 13.6488 8.8818 14.4864 36.8058 75.3312 20.3701 37.8825 475.6829 273.6941 182.4611 6.8911 11.2648 18.4833 7.3056 4.3688 7.9139 8.9140 14.1922 15.0442 15.9952 12.6049 7.5592 1.8660 12.7717 11.1188 4.7976 3.4427 1.6660 31.8268 8.9575 23.9698 14.9686 142.3689 19.3893 18.0241 11.7482 10.2647 11.0907 3.7881 244.8768 183.3787 238.3365 219.5944 70.5957 71.4880 66.1073 34.3354 23.7579 17.9194 21.9597 9.1824 6.5036 8.9238 28.0862 0.8801 32.3867 30.9428 34.9571 31.2572
temp: 298.150 k
press: 1.00000 atm
elementType: 8 8 8 8 8 8 8 7 7 6 6 6 6 6 6 6 6 6 6 6 1 1 1 1 1 1 1 1 1 1 1 1 1 1 1 1
symmnumber: 1
zpe: 726039.5 jmol-1
zpe.correction: 0.276534 hartree
zpe.thermalcorrener: 0.297143 hartree
zpe.thermalcorrenthalpy: 0.298087 hartree
zpe.thermalcorrgfe: 0.224122 hartree
zpe.sumelectzpe: -1063.313018 hartree
zpe.sumelectthermal: -1063.292409 hartree
zpe.sumelectthermalent: -1063.291465 hartree
zpe.sumelectthermalfe: -1063.365430 hartree
dipole: -0.7137 -0.5396 -1.9986
dipole: 2.1897
quadrupole: -100.5554 -105.1803 -124.5137
quadrupole: 4.0037 -11.3373 -0.1127
quadrupole: 9.5277 4.9028 -14.4306 4.0037 -11.3373 -0.1127
hfenergy: -1063.589552 hartree
pointgroup: C01 [X(C11H16N2O7)]
dipole: -0.0152876 0.743307 -0.4352546 debye
polarizability: 163.359268|10.1223194|156.4956848|1.7315206|6.9764296|128.967685 unknown
InChI: InChI=1S/C11H16N2O7/c14-8(13-3-1-2-7(13)11(19)20)4-12(5-9(15)16)6-10(17)18/h7,15,17,19H,1-6H2
charge 0 multiplicity 1
36 atoms
O  -0.904099 -2.000835 2.271029
O  -3.789326 -2.686631 -0.181894
O  -1.674797 -2.042617 -0.890333
O  3.703567 2.91363 1.529363
O  2.048863 -1.897696 -2.283341
O  1.385492 2.864409 1.643125
O  1.866356 0.406262 -2.061411
N  -1.594061 -0.078301 1.186695
N  1.421657 0.090454 0.777465
C  -2.883956 -0.707071 0.841184
C  -3.701028 0.459802 0.206693
C  -2.607026 1.386581 -0.384434
C  -1.469376 1.312292 0.657254
C  -0.64813 -0.82034 1.857371
C  0.736614 -0.190067 2.066583
C  -2.66662 -1.855825 -0.153712
C  2.671887 0.845141 0.927421
C  1.543803 -1.091399 -0.091595
C  2.460495 2.27917 1.397272
C  1.826151 -0.730065 -1.543121
H  -3.3766 -1.137836 1.728731
H  -4.429946 0.10109 -0.53781
H  -4.257246 0.978823 1.008111
H  -2.254011 0.994875 -1.355095
H  -2.962881 2.418981 -0.536326
H  -0.463296 1.466632 0.238617
H  -1.623065 2.043745 1.474904
H  0.632869 0.767758 2.607214
H  1.302051 -0.903365 2.708346
H  3.1707 0.919597 -0.055318
H  3.405821 0.371094 1.626226
H  0.584346 -1.642795 -0.098738
H  2.320725 -1.822391 0.239035
H  -3.637185 -3.427967 -0.828501
H  3.563898 3.857262 1.81384
H  2.180955 -1.658996 -3.240552
