program: Gaussian 09
title: 000146756
version: EM64L-G09RevD.01
frameworkgroup: C1[X(C15H18N2O3)]
method: RPBEPBE
basis: SDD
operation: Freq
keyword: #p
keyword: freq=noraman
keyword: PBEPBE/SDD
title: #p freq=noraman PBEPBE/SDD
converged: YES YES NO NO
title: Mulliken charges:
elementType: O O O N N C C C C C C C C C C C C C C C H H H H H H H H H H H H H H H H H H
charge: -0.294793 -0.220299 -0.219567 -0.035285 0.023403 -0.387837 -0.353287 -0.585178 -0.357182 0.553413 -0.354956 -0.567007 0.260748 0.194312 -0.385068 -0.379023 0.226153 -0.694744 -0.270206 -0.258540 0.217720 0.209119 0.189750 0.195437 0.226017 0.210564 0.189437 0.193095 0.195137 0.196767 0.317063 0.250819 0.298452 0.217255 0.211367 0.209908 0.288152 0.288883
chargesum: 0.00000
title: Mulliken charges with hydrogens summed into heavy atoms:
elementType: O O O N N C C C C C C C C C C C C C C C
charge: -0.294793 -0.220299 -0.219567 -0.035285 0.023403 0.039002 0.031900 -0.148597 0.025350 0.553413 0.036948 -0.249944 0.260748 0.194312 -0.134249 -0.080571 0.226153 -0.056214 0.017946 0.030343
polarizability: 2.82230487e+02 1.54938064e+00 2.40715845e+02 -3.30258365e+01 5.36558858e+00 1.15416386e+02
1716.lowfreq: -17.5645 -3.2387 -0.0005 -0.0004 0.0004 4.0821 11.1349 26.9496 32.3350
frequency: -8.5480 25.8591 32.2741 39.4816 56.3494 82.2682 103.3350 111.4641 126.1727 136.8395 165.6177 188.7760 226.7252 233.8446 280.4255 295.3057 316.9660 335.6004 370.6537 389.0336 400.7886 428.4683 432.6072 491.4360 521.8166 546.3332 594.9884 605.6026 636.5814 646.5269 694.7212 718.1565 722.7667 730.5660 739.3945 761.3356 770.1122 789.5562 835.2832 852.2356 873.8038 886.4255 898.3431 939.4291 966.5888 976.5334 991.3276 997.2348 1010.8758 1011.7009 1051.9628 1063.9389 1077.7672 1091.1768 1113.4563 1126.3299 1155.4974 1176.9792 1190.1325 1191.5085 1226.3544 1230.0892 1239.2054 1242.8867 1268.0229 1278.0632 1281.0916 1287.2028 1293.2422 1304.2089 1319.8805 1336.4050 1344.1608 1353.6419 1363.9803 1389.4793 1399.1538 1419.2013 1456.2707 1462.6393 1462.9809 1469.0762 1476.6383 1478.1026 1484.6778 1488.9021 1515.7173 1544.2061 1591.4706 1618.0733 2952.1524 2956.7118 2967.3608 2971.1548 2972.4472 2983.4893 2989.2590 3003.9495 3021.5191 3035.1500 3054.1177 3068.7457 3072.1391 3137.3969 3183.0064 3191.6974 3199.2139 3219.1331
redmass: 3.0883 2.5901 3.8121 6.9888 2.9591 4.7957 5.7826 1.7412 2.3110 4.0137 4.9952 4.2511 3.8747 1.1166 6.2924 4.2215 6.2719 8.6510 4.3790 5.7035 3.8174 3.3155 3.9582 4.4049 4.4400 5.9723 5.3821 6.1151 8.9154 3.4339 5.9076 5.2108 1.0685 5.8027 1.1084 4.7256 8.0088 1.2185 1.4587 1.5715 1.4585 1.9427 2.8491 1.4673 1.3182 1.3540 2.6085 1.3368 3.6181 3.2768 3.2347 2.7783 2.2660 1.3599 2.3600 1.5967 2.0248 1.5880 5.3875 1.6735 1.4601 1.8776 1.9482 2.1961 1.8778 1.2385 1.3433 1.1085 1.1126 2.3878 1.3785 6.4536 1.4803 1.6591 3.5416 1.2159 4.9563 2.8386 3.0704 1.0696 1.0918 1.0803 1.0784 1.0428 1.0881 1.0969 5.4624 6.7057 7.3521 6.8148 1.0588 1.0588 1.0590 1.0591 1.0366 1.0613 1.0963 1.1003 1.1021 1.1038 1.1043 1.1007 1.0993 1.0907 1.0944 1.0901 1.0916 1.0967
irintensity: 0.1693 0.0395 0.0919 0.0359 0.1016 3.7347 4.5442 0.0620 0.2762 2.0243 0.3532 2.1216 0.3327 0.0220 6.1858 0.0556 0.0455 1.5816 2.5467 1.5147 2.5443 2.3288 4.5952 2.7479 6.0603 3.9065 4.3059 0.4497 9.6614 1.1089 11.7473 6.8482 9.9912 13.9934 0.0449 0.1491 2.3250 2.1079 57.3650 28.8954 1.2779 1.4493 16.4559 10.7244 1.8981 3.4778 11.9779 3.2307 0.7249 5.7744 9.8629 0.9884 2.0105 2.4307 34.7447 25.8487 60.4891 81.7723 317.8674 4.2608 16.1528 31.7696 45.9966 109.3499 21.2424 4.2566 2.0855 1.3508 0.1872 3.6662 2.1021 83.5676 1.7600 1.1938 32.6328 10.8318 38.9930 1.2191 23.1006 0.1411 0.8701 1.8972 0.8398 12.5423 1.9275 27.7779 49.0557 4.8616 68.0068 60.1320 2.8134 9.6312 36.9208 54.9490 41.9493 60.6434 3.7965 0.6923 2.5836 37.4845 58.1650 91.6588 55.7333 11.9274 3.4667 4.8377 12.2458 3.0320
temp: 298.150 k
press: 1.00000 atm
elementType: 8 8 8 7 7 6 6 6 6 6 6 6 6 6 6 6 6 6 6 6 1 1 1 1 1 1 1 1 1 1 1 1 1 1 1 1 1 1
symmnumber: 1
zpe: 800486.8 jmol-1
zpe.correction: 0.304889 hartree
zpe.thermalcorrener: 0.323202 hartree
zpe.thermalcorrenthalpy: 0.324147 hartree
zpe.thermalcorrgfe: 0.256311 hartree
zpe.sumelectzpe: -915.978325 hartree
zpe.sumelectthermal: -915.960012 hartree
zpe.sumelectthermalent: -915.959068 hartree
zpe.sumelectthermalfe: -916.026904 hartree
dipole: -2.6030 -2.7301 0.3708
dipole: 3.7903
quadrupole: -111.5760 -140.0147 -119.0464
quadrupole: -0.8055 -3.6939 -3.1295
quadrupole: 11.9697 -16.4690 4.4993 -0.8055 -3.6939 -3.1295
hfenergy: -916.2832146 hartree
pointgroup: C01 [X(C15H18N2O3)]
dipole: 0.9987541 -1.106082 -0.0530315 debye
polarizability: 282.6584291|-4.9547294|239.373564|-31.499101|-14.1613317|116.3307256 unknown
InChI: InChI=1S/C15H18N2O3/c1-2-3-4-5-6-12-7-8-14-13(11-12)15(17(19)20)9-10-16(14)18/h7-11H,2-6H2,1H3
charge 0 multiplicity 1
38 atoms
O  -3.743589 -2.775431 0.822546
O  -3.52048 3.422711 -0.019179
O  -1.361739 3.036614 -0.628177
N  -3.417906 -1.518036 0.562675
N  -2.522262 2.619003 -0.225987
C  2.944761 -0.342216 -0.082724
C  4.399619 -0.116496 -0.549255
C  1.945285 -0.42052 -1.27362
C  5.401818 0.001524 0.621172
C  0.521435 -0.682356 -0.818415
C  6.860141 0.210881 0.152602
C  -0.38587 0.377441 -0.655739
C  -1.724369 0.166794 -0.189335
C  -2.102049 -1.198967 0.101043
C  0.102491 -2.016961 -0.513475
C  -1.191722 -2.275257 -0.062307
C  -2.735383 1.184051 0.012395
C  7.855919 0.344758 1.324816
C  -4.016065 0.822471 0.466441
C  -4.343922 -0.509566 0.734512
H  2.635858 0.479117 0.594196
H  2.885256 -1.277149 0.510753
H  4.706582 -0.951962 -1.213087
H  4.447796 0.805019 -1.166333
H  1.995033 0.528077 -1.840526
H  2.277202 -1.226592 -1.957782
H  5.347822 -0.91296 1.248416
H  5.103957 0.84616 1.276698
H  7.160219 -0.638397 -0.49476
H  6.911283 1.118897 -0.48235
H  -0.077142 1.396909 -0.887899
H  0.807767 -2.845305 -0.646736
H  -1.545024 -3.28258 0.17078
H  8.889636 0.494974 0.963006
H  7.595138 1.205323 1.969396
H  7.848425 -0.562287 1.958579
H  -4.766835 1.601695 0.611903
H  -5.321386 -0.837781 1.087955
