program: Gaussian 09
title: 000146755
version: EM64L-G09RevD.01
frameworkgroup: C1[X(C13H14N2O3)]
method: RPBEPBE
basis: SDD
operation: Freq
keyword: #p
keyword: freq=noraman
keyword: PBEPBE/SDD
title: #p freq=noraman PBEPBE/SDD
converged: YES YES NO YES
title: Mulliken charges:
elementType: O O O N N C C C C C C C C C C C C C H H H H H H H H H H H H H H
charge: -0.294116 -0.219950 -0.220276 -0.032971 0.022825 0.103345 0.588047 -0.697972 -0.697971 -0.740252 -0.579984 0.260851 -0.394525 0.192660 -0.427628 0.223313 -0.274152 -0.259251 0.217455 0.215333 0.227679 0.215338 0.217456 0.227678 0.222087 0.225339 0.225338 0.331868 0.247741 0.297983 0.287937 0.288774
chargesum: 0.00000
title: Mulliken charges with hydrogens summed into heavy atoms:
elementType: O O O N N C C C C C C C C C C C C C
charge: -0.294116 -0.219950 -0.220276 -0.032971 0.022825 0.103345 0.588047 -0.037504 -0.037498 -0.067488 -0.248117 0.260851 -0.146784 0.192660 -0.129645 0.223313 0.013785 0.029523
polarizability: 2.48886177e+02 2.54284560e-01 2.25640241e+02 2.15233221e-02 1.63505470e-02 8.74305825e+01
1716.lowfreq: -9.8907 -0.0006 0.0003 0.0004 3.1016 6.2011 32.1142 39.5617 61.5641
frequency: 32.1098 39.5091 61.5491 96.8982 126.0675 150.5175 183.8871 215.7424 226.3604 237.7118 266.9225 293.0958 308.9059 317.5551 337.0665 351.5847 353.6311 393.1651 417.1590 429.9958 452.4105 499.5260 528.0513 531.2644 598.0521 608.8711 636.2650 637.8078 652.3234 705.3293 727.2175 764.2598 771.0932 797.9457 834.3548 851.9660 877.9066 919.6092 934.5508 944.4970 949.4715 966.5408 985.7792 996.2474 1021.6426 1024.3995 1048.3562 1112.2623 1128.7853 1166.9025 1186.8087 1198.3740 1202.7459 1213.1807 1243.1497 1269.3441 1276.5406 1305.2320 1331.6292 1360.4326 1377.6207 1382.1336 1399.0003 1406.2002 1412.8266 1455.3007 1460.8760 1463.2942 1472.1347 1480.2304 1488.9252 1498.4544 1510.5695 1542.4593 1591.0184 1615.4123 2976.2098 2977.6389 2982.6086 3072.3965 3074.6352 3074.7479 3081.1554 3081.5152 3082.4929 3144.3312 3183.3067 3192.3075 3219.1704 3228.4386
redmass: 13.5531 3.0374 4.2038 7.8759 5.1320 3.6317 1.4671 1.9546 2.6376 1.3582 3.6154 4.2000 1.1918 3.7205 2.7838 7.9563 3.5045 2.8265 6.7633 3.3278 3.4919 3.3990 3.7246 5.8745 5.3689 5.7545 9.2247 4.7248 3.4818 5.3179 7.3936 4.5921 9.5953 3.5600 1.4638 1.5551 3.5228 1.7871 1.6451 1.2052 1.3775 1.3183 3.5346 1.3406 1.4293 1.3866 3.3232 1.9453 1.7500 2.2998 2.0473 3.5853 2.9475 2.7846 3.8727 2.1462 2.7639 2.2628 6.3560 3.7562 1.1813 1.2505 4.9247 1.4792 2.0409 2.1001 1.0502 1.0481 1.1873 1.0906 1.0497 1.0827 5.2995 6.3518 7.2468 6.7113 1.0346 1.0349 1.0362 1.1002 1.0999 1.1010 1.0995 1.0989 1.0991 1.0898 1.0946 1.0900 1.0967 1.0902
irintensity: 0.1175 0.1156 0.9670 7.6425 1.0613 2.3455 0.0066 0.0342 2.0050 0.2366 0.7700 4.5818 0.0487 0.0993 0.0139 1.2822 1.0118 1.3526 7.3331 1.5793 0.7546 1.6665 6.1152 4.4679 3.7050 0.1078 10.2054 0.7727 0.1984 20.3645 7.6932 0.0004 2.9570 2.3594 56.1544 27.1870 29.8380 1.2798 2.0941 0.0519 13.5641 1.9497 14.6980 3.1916 4.2946 0.8199 6.4280 9.0167 24.4304 161.0569 39.6962 339.3430 4.9917 45.0148 91.4110 72.2361 1.0004 3.6201 48.1474 47.0616 19.0641 29.0327 34.4201 9.2355 2.9179 19.0729 0.0170 0.6933 6.6577 17.3215 13.1222 27.1076 43.8352 5.2690 66.3264 52.4075 29.9176 30.1181 19.1473 4.2282 9.9902 0.9566 40.8127 61.7200 86.7245 13.9338 4.1117 5.0341 2.7505 9.9830
temp: 298.150 k
press: 1.00000 atm
elementType: 8 8 8 7 7 6 6 6 6 6 6 6 6 6 6 6 6 6 1 1 1 1 1 1 1 1 1 1 1 1 1 1
symmnumber: 1
zpe: 652132.1 jmol-1
zpe.correction: 0.248384 hartree
zpe.thermalcorrener: 0.264637 hartree
zpe.thermalcorrenthalpy: 0.265581 hartree
zpe.thermalcorrgfe: 0.204493 hartree
zpe.sumelectzpe: -837.531630 hartree
zpe.sumelectthermal: -837.515377 hartree
zpe.sumelectthermalent: -837.514433 hartree
zpe.sumelectthermalfe: -837.575521 hartree
dipole: 2.9078 -2.2659 0.0001
dipole: 3.6864
quadrupole: -92.6339 -128.3062 -106.4494
quadrupole: 2.7477 0.0024 -0.0021
quadrupole: 16.4960 -19.1764 2.6804 2.7477 0.0024 -0.0021
hfenergy: -837.7800143 hartree
pointgroup: C01 [X(C13H14N2O3)]
dipole: 1.1129147 -0.9300098 0.0000589 debye
polarizability: 248.8764547|-0.5390511|225.6499639|0.0220687|0.0156066|87.4305825 unknown
InChI: InChI=1S/C13H14N2O3/c1-13(2,3)9-4-5-11-10(8-9)12(15(17)18)6-7-14(11)16/h4-8H,1-3H3
charge 0 multiplicity 1
32 atoms
O  -2.330599 -3.156171 -0.000616
O  -2.907659 3.075223 0.000048
O  -0.632208 3.06436 0.000267
N  -2.15838 -1.842683 -0.000463
N  -1.772557 2.445524 0.000108
C  3.289205 0.181876 0.000547
C  1.824181 -0.306734 0.000273
C  4.00743 -0.363762 -1.272102
C  4.006963 -0.363894 1.273406
C  3.400147 1.727198 0.000642
C  0.738999 0.584146 0.000225
C  -0.62308 0.135227 -0.000014
C  1.554313 -1.716177 0.00008
C  -0.838653 -1.292731 -0.000207
C  0.24911 -2.203522 -0.000156
C  -1.802974 0.975332 -0.000079
C  -3.082339 0.390876 -0.000324
C  -3.248563 -0.99683 -0.000513
H  5.063283 -0.035615 -1.275256
H  3.998319 -1.467755 -1.313404
H  3.525289 0.016217 -2.191083
H  3.997794 -1.467891 1.314604
H  5.062824 -0.03578 1.27697
H  3.5245 0.01602 2.192246
H  4.466121 2.018237 0.000791
H  2.931695 2.174853 -0.894777
H  2.931475 2.174766 0.895989
H  0.907222 1.658379 0.000358
H  2.384358 -2.429968 0.000115
H  0.021458 -3.272114 -0.000306
H  -3.961132 1.038644 -0.000364
H  -4.218044 -1.494948 -0.000704
