program: Gaussian 09
title: 000146751
version: EM64L-G09RevD.01
frameworkgroup: C1[X(C17H12)]
method: RPBEPBE
basis: SDD
operation: Freq
keyword: #p
keyword: freq=noraman
keyword: PBEPBE/SDD
title: #p freq=noraman PBEPBE/SDD
converged: NO NO NO NO
title: Mulliken charges:
elementType: C C C C C C C C C C C C C C C C C H H H H H H H H H H H H
charge: -0.523330 0.062249 0.263815 0.275153 0.306683 0.550512 0.356421 -0.391626 -0.425846 -0.465066 -0.440119 -0.438723 -0.441551 -0.237902 -0.216695 -0.228372 -0.825842 0.252381 0.248797 0.251889 0.238174 0.237981 0.227568 0.220404 0.221475 0.225889 0.233302 0.233322 0.229054
chargesum: 0.00000
title: Mulliken charges with hydrogens summed into heavy atoms:
elementType: C C C C C C C C C C C C C C C C C
charge: -0.523330 0.062249 0.263815 0.275153 0.306683 0.550512 0.356421 -0.139245 -0.177049 -0.213176 -0.201945 -0.200742 -0.213984 -0.017497 0.004780 -0.002483 -0.130165
polarizability: 2.78228725e+02 -5.43632952e+00 2.25443855e+02 1.12061963e-03 -5.91232565e-04 7.34109808e+01
1716.lowfreq: -0.0006 -0.0002 0.0003 10.3774 14.1990 17.3598 85.8091 106.8825 167.2435
frequency: 85.8041 106.8770 167.2424 185.0528 190.6989 211.4593 260.3384 298.5747 307.0584 358.6018 432.9735 459.9916 463.8613 485.1944 515.1248 531.0607 559.9036 575.9262 589.3175 617.7917 641.3463 654.9573 749.6658 752.9428 773.0002 789.9818 795.5493 810.6165 810.7898 856.5829 907.2278 916.8386 923.3946 926.7779 972.0606 975.1927 979.3472 986.9285 1004.8610 1043.3159 1044.0474 1048.5090 1073.0979 1115.8798 1156.1612 1176.4761 1189.0123 1199.4627 1233.8275 1250.3550 1265.1521 1287.5783 1344.5788 1386.7777 1395.1641 1397.4743 1408.0849 1425.3314 1451.4047 1466.7422 1471.2521 1475.6653 1483.8136 1496.2674 1588.8164 1602.2737 1611.2137 1613.2857 1626.6985 2968.8882 3046.2190 3078.9780 3118.8539 3122.1346 3123.5312 3131.9726 3134.8440 3144.4910 3153.8518 3155.1990 3164.4970
redmass: 3.5359 4.5869 2.0523 3.9287 1.4204 3.3011 3.2327 3.5695 4.7478 4.8838 4.2955 4.7636 3.2036 5.2563 3.4214 5.4219 6.0464 3.4330 5.8145 7.4255 3.6507 3.1372 1.5668 6.0212 1.3212 1.5734 5.2518 5.8270 2.5155 3.1052 1.3517 1.4720 3.6448 1.4800 3.0169 1.3679 1.3544 1.3770 2.7078 2.2962 1.5612 1.9937 2.0086 2.0111 1.5174 1.1717 1.7166 1.3249 1.6940 2.6328 1.9507 2.6827 2.7479 2.3396 3.1674 1.3802 3.3855 2.3184 3.3130 4.4156 1.0460 2.6474 1.3809 3.6974 7.0024 7.1512 8.1716 6.8369 7.6101 1.0374 1.0976 1.0982 1.0862 1.0860 1.0863 1.0914 1.0920 1.0933 1.0989 1.0984 1.0958
irintensity: 0.3607 2.7608 5.7765 0.1327 0.0187 2.3228 0.3531 0.2071 0.0020 1.0229 0.0052 0.6122 0.0612 0.9647 2.2420 2.6843 1.5066 1.0195 0.1812 0.1657 9.3620 0.0302 6.1682 2.0415 5.4253 137.1731 0.1132 2.9514 17.2827 34.1300 0.6171 0.0649 1.4256 0.3485 0.4209 0.6548 0.0934 2.6360 0.2772 2.7472 7.9864 5.5395 6.5786 5.1255 5.3722 1.4495 1.0477 2.0624 4.9071 0.2955 0.1340 0.7880 1.2859 16.5897 1.3226 10.7274 2.2229 0.4604 18.2263 24.0750 14.7271 3.4720 55.0620 2.6050 6.7927 2.2200 3.9858 3.8720 0.7572 26.6054 19.0369 27.1621 4.2866 1.5249 1.1214 22.8329 9.0654 29.0310 47.4221 38.7468 21.3503
temp: 298.150 k
press: 1.00000 atm
elementType: 6 6 6 6 6 6 6 6 6 6 6 6 6 6 6 6 6 1 1 1 1 1 1 1 1 1 1 1 1
symmnumber: 1
zpe: 605921.1 jmol-1
zpe.correction: 0.230783 hartree
zpe.thermalcorrener: 0.242866 hartree
zpe.thermalcorrenthalpy: 0.243810 hartree
zpe.thermalcorrgfe: 0.193138 hartree
zpe.sumelectzpe: -653.912947 hartree
zpe.sumelectthermal: -653.900864 hartree
zpe.sumelectthermalent: -653.899920 hartree
zpe.sumelectthermalfe: -653.950592 hartree
dipole: -0.1686 0.4429 0.0003
dipole: 0.4739
quadrupole: -83.9216 -83.4485 -105.9495
quadrupole: 1.3099 -0.0001 -0.0001
quadrupole: 7.1850 7.6580 -14.8430 1.3099 -0.0001 -0.0001
hfenergy: -654.1437301 hartree
pointgroup: C01 [X(C17H12)]
dipole: 0.0724945 0.1717561 -0.0001286 debye
polarizability: 278.5491198|3.541047|225.12346|0.001141|0.0005509|73.4109808 unknown
InChI: InChI=1S/C17H12/c1-11-5-2-8-13-14-9-3-6-12-7-4-10-15(16(11)13)17(12)14/h2-10H,1H3
charge 0 multiplicity 1
29 atoms
C  1.066765 0.012536 0.000003
C  -1.248102 0.342723 -0.000063
C  0.06619 1.039066 -0.000031
C  0.475677 -1.289312 -0.000083
C  -0.992023 -1.082418 -0.000079
C  2.466519 0.25173 -0.00008
C  -2.573228 0.839326 -0.000087
C  0.496387 2.37437 -0.000143
C  1.318609 -2.407786 -0.000156
C  -2.052946 -2.004629 -0.000196
C  2.876529 1.629339 -0.000186
C  3.310936 -0.911462 -0.000122
C  -3.629725 -0.114599 -0.000189
C  1.907936 2.64758 -0.000207
C  2.739489 -2.196628 -0.000155
C  -3.38013 -1.507499 -0.000262
C  -2.880135 2.325643 -0.000001
H  -0.207744 3.211794 -0.000166
H  0.922532 -3.429541 -0.000196
H  -1.866238 -3.084047 -0.000221
H  3.942213 1.888147 -0.000234
H  4.401854 -0.800039 -0.000183
H  -4.666691 0.242752 -0.000204
H  2.239395 3.69241 -0.000263
H  3.402082 -3.06983 -0.00018
H  -4.22492 -2.205544 -0.000346
H  -2.455292 2.826354 0.891086
H  -2.456385 2.826209 -0.8917
H  -3.968954 2.506355 0.000644
