program: Gaussian 09
title: 000146745
version: EM64L-G09RevD.01
frameworkgroup: C1[X(C16H14)]
method: RPBEPBE
basis: SDD
operation: Freq
keyword: #p
keyword: freq=noraman
keyword: PBEPBE/SDD
title: #p freq=noraman PBEPBE/SDD
converged: NO YES NO YES
title: Mulliken charges:
elementType: C C C C C C C C C C C C C C C C H H H H H H H H H H H H H H
charge: 0.117508 0.243469 0.200124 0.438460 0.333835 0.360909 -0.783657 -0.402425 -0.340337 -0.437758 -0.473561 -0.854766 -0.277089 -0.879234 -0.289608 -0.252804 0.237607 0.250401 0.243946 0.225493 0.243661 0.231588 0.231618 0.242628 0.227850 0.237666 0.235197 0.235204 0.224315 0.229759
chargesum: 0.00000
title: Mulliken charges with hydrogens summed into heavy atoms:
elementType: C C C C C C C C C C C C C C C C
charge: 0.117508 0.243469 0.200124 0.438460 0.333835 0.360909 -0.546050 -0.152024 -0.096391 -0.212265 -0.229900 -0.148931 -0.049240 -0.171167 -0.065293 -0.023044
polarizability: 2.68025634e+02 -1.72896804e-02 2.00970701e+02 -6.10157929e-04 4.38509668e-03 7.54447787e+01
1716.lowfreq: -30.5387 -7.7438 -5.0144 -0.0007 -0.0004 0.0006 8.2862 77.5931 134.9311
frequency: -30.4568 77.5878 134.9299 184.5568 233.5831 250.6909 270.8218 291.2141 299.8856 332.9934 355.2622 394.6134 438.8373 442.1609 476.3108 500.8815 520.9897 538.1696 564.4444 581.2271 636.6081 643.1043 666.8986 737.4929 758.6019 761.9229 787.9001 833.7245 845.9363 864.3581 889.1468 905.4575 915.8147 958.9056 980.0099 982.3575 988.1177 999.9125 1021.3697 1045.0731 1050.0279 1054.5381 1091.3490 1126.9480 1153.4510 1179.1581 1185.3592 1227.4735 1235.2181 1256.7524 1279.3111 1311.8459 1348.9509 1386.1582 1397.6075 1399.9652 1403.7719 1406.6355 1434.8301 1448.3906 1473.2661 1482.4432 1488.1628 1496.4824 1500.9079 1540.7052 1580.0379 1604.5179 1617.4553 1642.3076 2971.5783 2972.6215 3046.4339 3056.2858 3075.5887 3085.0237 3114.9534 3120.1021 3121.3408 3132.8228 3143.4596 3157.6525 3168.1671 3259.9299
redmass: 3.0155 3.6097 3.6311 2.6934 1.1693 4.7354 3.3976 2.9085 2.6355 3.3631 1.2797 6.0009 4.8522 2.8625 3.2040 4.8383 2.9706 5.0820 3.9182 3.2237 3.0726 5.6266 5.6545 2.2287 1.3837 5.2984 1.4448 2.1051 5.0167 1.5346 4.1886 1.4211 1.8080 1.4231 1.3491 6.2332 1.3447 1.6728 1.5154 1.5690 1.5987 2.1676 2.9079 1.7927 1.9390 1.1366 1.3201 1.7710 1.5150 2.9211 2.0311 1.9184 5.9905 2.8367 1.7653 1.3364 2.4347 2.2542 2.3025 2.3319 1.0465 1.2006 1.0487 1.5059 1.7170 4.1377 7.0217 5.4103 6.1153 6.9072 1.0378 1.0374 1.0973 1.0986 1.0975 1.0979 1.0913 1.0868 1.0870 1.0908 1.0917 1.0995 1.0974 1.0888
irintensity: 0.0009 0.0114 4.3153 0.1101 0.0840 0.8845 5.5171 0.8144 0.6937 0.4785 1.6740 0.8964 0.4592 0.6006 0.7967 0.4806 3.5405 1.6103 0.4709 0.0648 2.7440 3.3325 0.3167 51.3476 61.1719 0.5797 15.7099 7.2588 0.8176 10.2861 1.2434 3.1004 16.2632 5.1757 0.2195 3.2412 0.5373 1.1814 7.3135 7.5484 6.7607 4.1238 0.8727 9.2379 3.3502 2.6171 0.1779 1.6111 2.2226 0.4733 2.4038 3.1129 1.5747 3.5221 8.6744 18.1229 5.1500 3.4257 11.1281 14.7478 14.3093 4.1706 13.5624 30.5794 11.3630 0.5486 2.5895 3.4911 1.5319 8.0208 42.8631 25.4411 19.8122 16.2722 29.6320 19.2888 11.9711 13.7197 7.9828 21.7255 24.2649 41.8768 27.5221 7.9080
temp: 298.150 k
press: 1.00000 atm
elementType: 6 6 6 6 6 6 6 6 6 6 6 6 6 6 6 6 1 1 1 1 1 1 1 1 1 1 1 1 1 1
symmnumber: 1
zpe: 648028.2 jmol-1
zpe.correction: 0.246821 hartree
zpe.thermalcorrener: 0.258529 hartree
zpe.thermalcorrenthalpy: 0.259473 hartree
zpe.thermalcorrgfe: 0.209898 hartree
zpe.sumelectzpe: -617.028951 hartree
zpe.sumelectthermal: -617.017243 hartree
zpe.sumelectthermalent: -617.016299 hartree
zpe.sumelectthermalfe: -617.065874 hartree
dipole: -0.3395 -0.0256 0.0003
dipole: 0.3404
quadrupole: -83.1813 -80.1636 -101.0104
quadrupole: -0.5222 -0.0002 0.0011
quadrupole: 4.9372 7.9549 -12.8920 -0.5222 -0.0002 0.0011
hfenergy: -617.2757715 hartree
pointgroup: C01 [X(C16H14)]
dipole: 0.1338396 -0.0049703 -0.0001263 debye
polarizability: 267.9269075|2.571123|201.0694279|-0.0004426|-0.0044052|75.4447787 unknown
InChI: InChI=1S/C16H14/c1-11-6-5-9-14-12(2)10-13-7-3-4-8-15(13)16(11)14/h3-10H,1-2H3
charge 0 multiplicity 1
30 atoms
C  0.55772 -0.499791 0.000033
C  1.309918 0.751486 0.000001
C  -0.920829 -0.417286 0.000037
C  -1.546122 0.891017 -0.000052
C  0.635504 2.04655 0.000067
C  1.325258 -1.733909 0.000045
C  -0.743924 2.086298 -0.000039
C  2.738143 0.739911 -0.000098
C  -1.818316 -1.536483 0.00007
C  2.736266 -1.678498 -0.000034
C  -2.968821 1.0243 -0.000149
C  1.428679 3.342033 -0.00013
C  3.451739 -0.458612 -0.000153
C  0.747266 -3.145016 0.000028
C  -3.21409 -1.385874 0.000034
C  -3.805798 -0.095463 -0.000144
H  -1.262254 3.053286 -0.000088
H  3.280332 1.689209 -0.000134
H  -1.439319 -2.552934 0.000151
H  3.294143 -2.622183 -0.000064
H  -3.395857 2.034424 -0.000224
H  2.080687 3.426902 0.89023
H  2.079944 3.42708 -0.89102
H  0.747523 4.209199 0.000236
H  4.547085 -0.460308 -0.000221
H  1.570942 -3.878931 -0.000032
H  0.131613 -3.349569 0.895433
H  0.131521 -3.349516 -0.895326
H  -3.848051 -2.279793 0.000068
H  -4.895103 0.01897 -0.000226
