program: Gaussian 09
title: 000146804
version: EM64L-G09RevD.01
frameworkgroup: C1[X(C23H16O6)]
method: RPBEPBE
basis: SDD
operation: Freq
keyword: #pfreq=noraman
keyword: PBEPBE/SDD
title: #p freq=noraman PBEPBE/SDD
converged: YES YES NO NO
title: Mulliken charges:
elementType: O O O O O O C C C C C C C C C C C C C C C C C C C C C C C H H H H H H H H H H H H H H H H
charge: -0.394749 -0.418136 -0.298314 -0.186204 -0.370987 -0.408666 0.203024 -0.596362 0.332621 -0.624526 0.027558 0.429410 -0.074682 0.020888 0.312479 -0.726812 0.123920 -0.653319 0.037239 -0.309351 0.168868 0.351932 0.501649 -0.561131 0.216737 -0.575789 -0.814725 0.350405 -0.603849 0.282689 0.233043 0.235687 0.232614 0.331361 0.243950 0.258412 0.321622 0.387836 0.229727 0.225829 0.237519 0.221195 0.373970 0.361557 0.363860
chargesum: 0.00000
title: Mulliken charges with hydrogens summed into heavy atoms:
elementType: O O O O O O C C C C C C C C C C C C C C C C C C C C C C C
charge: -0.006913 -0.044166 -0.298314 -0.186204 -0.009430 -0.044806 0.203024 -0.080630 0.332621 -0.156225 0.027558 0.429410 -0.074682 0.020888 0.312479 -0.395451 0.123920 -0.409369 0.037239 -0.309351 0.168868 0.351932 0.501649 -0.302719 0.216737 -0.254166 -0.121650 0.350405 -0.382653
polarizability: 5.83254997e+02 4.06686444e+00 3.08242136e+02 -3.50571084e+00 -1.12826881e+00 1.23713934e+02
1716.lowfreq: -11.4238 -3.5353 -0.0002 0.0007 0.0011 3.3584 7.9996 24.4182 39.4684
frequency: -10.9729 24.3935 39.4515 51.9813 67.0698 78.8948 120.5222 129.0806 155.0604 159.6769 177.7614 195.4044 209.9175 221.6990 233.5730 250.4050 267.7060 283.3655 295.7541 311.8662 317.3492 330.1458 350.1875 382.3481 383.7087 386.7722 407.5768 424.9377 445.4582 450.9753 452.1278 468.8221 484.7599 500.2508 517.4795 522.0285 531.3353 543.8176 555.8748 571.2823 579.0032 593.8999 607.8910 612.5256 626.4644 643.0888 685.8620 693.5934 717.5441 747.1922 753.9877 765.4826 783.0302 812.1714 844.1130 848.9609 864.0167 872.8403 892.7938 927.7561 936.6774 949.5764 960.3745 980.1658 987.8544 992.2892 997.3200 1014.3818 1031.1627 1045.5759 1051.0242 1077.4341 1105.8649 1136.8485 1143.5603 1154.2202 1166.3220 1179.5734 1187.5031 1195.9819 1220.0818 1223.5893 1247.5263 1257.8931 1288.8628 1301.3487 1314.0370 1333.1181 1335.5596 1345.9785 1355.7557 1374.4850 1396.7023 1403.9028 1407.3660 1420.9071 1428.8472 1438.3539 1454.4529 1457.9601 1461.7887 1473.5598 1473.7005 1486.3337 1491.1390 1538.9826 1548.9011 1557.5332 1575.4531 1588.5355 1608.7930 1627.4628 1634.3098 2580.2079 2963.4153 2973.1091 2976.7530 3049.5579 3058.7092 3077.4466 3088.8874 3104.8918 3123.8847 3137.1479 3156.8933 3181.4517 3526.5888 3537.6396 3576.9077
redmass: 1.0195 5.9047 6.4005 5.6786 8.0597 6.0209 6.5260 7.5764 5.1708 4.6773 7.0158 4.2215 5.2527 4.6328 6.2703 2.8720 4.3519 5.6235 4.5016 4.8340 3.7526 6.5200 5.2355 4.7210 1.1969 3.3960 1.4030 7.5550 4.3617 5.3991 1.5433 4.6793 4.4296 4.3939 5.4940 5.1748 4.9087 8.2128 5.5391 5.2285 4.8498 4.2623 5.0813 5.8199 3.9367 3.2050 4.7227 4.8641 6.0876 5.0741 4.5719 6.0677 4.8485 1.8698 4.9463 3.9622 1.7110 1.9611 1.4171 1.5395 3.4713 3.1998 2.2121 3.2973 2.2319 1.0793 3.8637 2.5431 2.2299 1.5760 2.7407 3.1003 2.9822 2.0108 1.3267 1.2209 1.4911 1.4574 1.7472 2.2762 1.4599 1.8329 2.0053 1.5024 2.3866 1.5065 3.8174 4.4481 4.9590 2.8099 3.9601 4.3664 1.2334 5.1713 6.2479 5.8566 4.3675 2.9738 1.5118 1.5224 1.3336 1.3954 1.0635 3.3211 3.9231 5.0346 6.6239 4.1713 6.3883 6.0275 5.0845 6.5582 6.4984 1.0735 1.0688 1.0649 1.0389 1.0957 1.0946 1.0924 1.0999 1.0914 1.0915 1.0910 1.0922 1.0926 1.0659 1.0658 1.0662
irintensity: 0.3188 3.5755 0.6971 1.7084 0.2123 1.9150 1.0971 0.5090 0.5179 0.8437 2.4140 4.5486 1.2535 0.2412 1.1510 2.2537 1.8613 8.6350 4.7948 2.9118 1.0264 7.3800 12.1078 18.4604 165.3894 49.6832 54.4225 11.6767 1.9724 24.9369 80.7569 49.0633 4.0963 21.7496 5.8038 14.9853 6.3282 16.6369 1.8651 11.4881 2.3103 6.3320 5.4584 2.8404 18.7023 20.6887 14.8838 14.5818 18.5297 6.1505 4.2467 1.4703 2.4266 47.3393 34.7683 2.9530 20.9168 21.4865 2.5225 10.0576 0.8542 43.7878 29.9344 3.4438 8.4945 122.5578 23.9108 58.5442 1.1929 28.0950 1.8975 28.1489 190.7989 168.6798 88.6433 29.4633 166.7978 14.2572 133.3721 0.9633 2.9756 9.1233 96.4862 14.5233 180.3596 0.7885 20.4758 181.2907 821.4452 191.5480 223.3203 46.7060 12.7507 104.6783 58.0062 20.4942 16.4413 14.4913 38.8888 5.6597 19.5128 26.1397 12.7858 44.3400 28.9764 221.7742 1.9009 108.2052 55.4752 115.0144 490.4385 88.1538 70.6024 315.3817 14.4664 27.9456 42.3554 33.7813 21.6067 6.6794 16.6133 21.2133 20.7654 2.1300 7.6117 6.8459 61.4260 38.0422 90.9323
temp: 298.150 k
press: 1.00000 atm
elementType: 8 8 8 8 8 8 6 6 6 6 6 6 6 6 6 6 6 6 6 6 6 6 6 6 6 6 6 6 6 1 1 1 1 1 1 1 1 1 1 1 1 1 1 1 1
symmnumber: 1
zpe: 871201.2 jmol-1
zpe.correction: 0.331823 hartree
zpe.thermalcorrener: 0.354708 hartree
zpe.thermalcorrenthalpy: 0.355652 hartree
zpe.thermalcorrgfe: 0.280640 hartree
zpe.sumelectzpe: -1335.437791 hartree
zpe.sumelectthermal: -1335.414906 hartree
zpe.sumelectthermalent: -1335.413961 hartree
zpe.sumelectthermalfe: -1335.488974 hartree
dipole: -4.0166 1.3519 -0.2396
dipole: 4.2448
quadrupole: -84.9510 -187.0843 -168.8717
quadrupole: 4.2923 -2.4493 -2.9893
quadrupole: 62.0180 -40.1153 -21.9027 4.2923 -2.4493 -2.9893
hfenergy: -1335.7696135 hartree
pointgroup: C01 [X(C23H16O6)]
dipole: 1.5763861 0.5426265 0.0978697 debye
polarizability: 583.3193994|-2.3608855|308.2071003|-1.0666361|-0.5072977|123.6845678 unknown
InChI: InChI=1S/C23H16O6/c1-9-4-10-2-3-12-13(18(10)16(25)5-9)8-15-20(22(12)28)23(29)19-14(21(15)27)6-11(24)7-17(19)26/h4-8,24-26,28H,2-3H2,1H3
charge 0 multiplicity 1
45 atoms
O  0.18271 3.290572 -0.34323
O  -2.885956 -2.478498 -1.123492
O  2.60962 2.709296 -0.290807
O  1.405884 -2.653547 0.29085
O  5.205816 2.110236 -0.225424
O  6.395938 -2.602193 0.347052
C  -1.457304 1.545196 -0.194661
C  -2.570096 2.571516 -0.226779
C  -1.786387 0.162295 -0.095436
C  -3.70989 2.125963 0.719145
C  -3.218604 -0.223455 -0.093777
C  -4.191041 0.729224 0.352757
C  -0.094108 1.950474 -0.225885
C  0.96667 0.98291 -0.138593
C  0.616601 -0.391104 0.015247
C  -0.73208 -0.79118 0.046864
C  -3.696958 -1.499801 -0.526287
C  -5.548796 0.373262 0.451309
C  2.365687 1.437042 -0.167438
C  1.6820 -1.419146 0.153378
C  3.44393 0.437409 -0.043906
C  3.113188 -0.952395 0.115529
C  -6.000641 -0.925942 0.09387
C  -5.059511 -1.849652 -0.4074
C  4.834435 0.779513 -0.06983
C  4.101846 -1.942534 0.242371
C  -7.469487 -1.294865 0.194446
C  5.463076 -1.57334 0.214818
C  5.831253 -0.219671 0.058974
H  -2.171579 3.560195 0.053058
H  -2.965403 2.663755 -1.260046
H  -4.550245 2.841309 0.671768
H  -3.334864 2.137601 1.763768
H  -0.929388 -1.843683 0.278809
H  -6.271893 1.115616 0.810232
H  -5.363853 -2.847316 -0.739284
H  3.807051 -2.987806 0.362093
H  1.229024 3.369744 -0.349942
H  -7.604419 -2.378601 0.354381
H  -7.964073 -0.759901 1.024237
H  -8.009266 -1.029301 -0.735476
H  6.892163 0.067613 0.036334
H  -1.985486 -2.124529 -1.34051
H  6.193668 2.201438 -0.228608
H  7.32637 -2.26572 0.320423
