program: Gaussian 09
title: 000146779
version: EM64L-G09RevD.01
frameworkgroup: C1[X(C17H15I2NO5)]
method: RPBEPBE
basis: SDD
operation: Freq
keyword: #p
keyword: freq=noraman
keyword: PBEPBE/SDD
title: #p freq=noraman PBEPBE/SDD
converged: NO YES NO NO
title: Mulliken charges:
elementType: I I O O O O O N C C C C C C C C C C C C C C C C C H H H H H H H H H H H H H H H
charge: 0.150525 0.145317 -0.278970 -0.409619 -0.236228 -0.373442 -0.188968 -0.581277 -0.606500 -0.178625 0.536602 -0.348966 -0.370765 0.506990 -0.480608 -0.473656 0.199828 0.312723 0.254886 -0.383339 -0.347474 0.147383 -0.377761 0.112172 -0.821907 0.236570 0.226173 0.265471 0.254898 0.273787 0.283803 0.298145 0.272596 0.262638 0.224362 0.389992 0.250691 0.234247 0.264079 0.354229
chargesum: 0.00000
title: Mulliken charges with hydrogens summed into heavy atoms:
elementType: I I O O O O O N C C C C C C C C C C C C C C C C C
charge: 0.150525 0.145317 -0.278970 -0.019627 -0.236228 -0.019213 -0.188968 0.000671 -0.143757 0.086847 0.536602 -0.094068 -0.096977 0.506990 -0.480608 -0.473656 0.199828 0.312723 0.254886 -0.110744 -0.084837 0.147383 -0.153399 0.112172 -0.072891
polarizability: 3.27730169e+02 -4.45082503e+00 2.49987146e+02 1.41858589e+01 6.03590991e+00 2.09685451e+02
1716.lowfreq: -0.0007 -0.0006 -0.0005 0.4515 3.4979 6.9490 14.2039 16.7935 21.9371
frequency: 14.0955 16.7570 21.8870 24.5109 30.7523 40.8472 41.8085 52.2390 61.0238 90.6936 101.9790 129.0971 141.1463 160.0629 170.4613 189.7679 203.3061 207.3153 218.6590 228.5456 248.5789 259.9612 284.7396 301.5852 341.5560 350.5695 366.4991 379.4531 384.4331 391.1011 427.8872 441.9536 468.6178 489.1200 492.9236 506.4168 515.2374 517.9813 541.4261 597.0810 599.3407 615.6697 616.4861 645.4352 665.0082 690.0929 726.7964 727.8617 730.8931 761.5849 765.0839 799.3742 807.4734 867.9663 885.5568 893.8526 897.2186 901.2337 937.1175 942.7113 950.3796 970.2293 1024.0412 1029.9866 1052.5042 1055.7267 1099.6181 1110.7164 1128.1499 1156.2796 1168.9196 1182.1767 1198.2331 1202.9675 1229.7425 1248.2377 1254.9422 1257.2709 1281.3028 1298.6825 1321.6585 1345.4402 1366.4534 1379.0132 1394.5228 1400.9216 1405.4907 1423.8335 1454.3842 1464.1222 1470.0945 1492.7441 1535.2019 1574.0377 1581.8126 1609.3746 1612.6438 1620.9010 1668.7402 2976.8144 2999.2477 3050.2090 3064.6017 3071.3016 3117.9986 3119.0222 3149.9154 3154.6791 3174.3592 3177.5774 3489.5819 3492.6577 3538.5136 3632.8067
redmass: 13.9971 11.0432 8.8900 6.3019 8.6669 7.0025 4.5358 6.6993 6.6317 16.6734 6.2310 6.9780 4.3400 8.4409 4.5760 4.3428 1.3211 2.6471 1.7572 7.3584 4.6172 4.4099 2.5773 4.0291 5.2516 3.9253 3.5128 3.5030 6.3572 1.4380 3.5653 4.0465 2.7647 1.8123 5.1230 6.0021 4.1953 3.5447 4.8690 3.3431 3.7093 2.1664 2.4844 2.1578 6.1262 8.9897 6.0726 4.4674 3.4675 3.0178 6.1098 5.8061 1.5349 2.3299 3.0885 1.4570 1.3614 6.4823 1.3362 2.3421 1.7374 4.9763 1.7937 3.9581 2.3134 2.5031 1.4785 1.6111 1.6424 1.2693 2.2245 1.6264 1.5945 1.7044 5.6885 4.5184 2.7646 1.7490 1.4008 1.4244 1.2237 6.4297 1.2305 2.5593 4.3127 1.8587 5.3926 3.8345 1.0968 1.1071 1.0530 2.7173 7.9042 6.7192 7.1711 6.8901 1.2991 7.1839 3.9321 1.0367 1.0599 1.0899 1.0979 1.1007 1.0902 1.0988 1.0920 1.0929 1.0949 1.0905 1.0633 1.0450 1.0657 1.1003
irintensity: 0.3023 0.7610 0.1599 3.2213 3.3111 1.8107 2.8878 1.5121 1.2976 0.1713 0.3559 1.5324 1.8549 0.5423 0.0261 3.5880 2.2479 3.6501 50.9665 4.3429 5.6910 12.2049 26.0633 1.3958 0.4277 1.5743 5.2418 34.2657 0.9429 85.6766 4.3358 34.4064 41.6628 194.5955 1.3550 11.5991 15.3652 1.8290 56.5902 15.0397 2.5112 97.4237 34.6679 78.0748 5.1000 63.4181 4.7124 48.5481 1.4435 5.4822 33.1146 23.5320 44.3754 8.6279 11.4149 14.6014 0.3631 25.1509 0.1203 31.8265 10.6971 59.1561 6.2238 11.4072 230.0356 102.6755 19.4725 127.8084 13.7283 110.4089 58.3955 2.5617 11.4930 56.2299 166.9410 111.2655 65.8752 7.5904 6.2953 68.8592 5.1434 4.0471 34.5963 36.6949 112.3150 11.7336 1.7916 175.3651 44.0475 9.5613 18.2443 86.0962 68.6879 109.0168 118.2872 52.9704 144.4593 17.3552 125.1040 7.6466 32.6486 5.6097 11.2214 15.9562 19.2893 13.9531 1.8680 3.7051 1.9382 1.7980 17.5873 24.0540 34.0386 11.8771
temp: 298.150 k
press: 1.00000 atm
elementType: 53 53 8 8 8 8 8 7 6 6 6 6 6 6 6 6 6 6 6 6 6 6 6 6 6 1 1 1 1 1 1 1 1 1 1 1 1 1 1 1
symmnumber: 1
zpe: 748620.8 jmol-1
zpe.correction: 0.285135 hartree
zpe.thermalcorrener: 0.311135 hartree
zpe.thermalcorrenthalpy: 0.312079 hartree
zpe.thermalcorrgfe: 0.222613 hartree
zpe.sumelectzpe: -1108.859381 hartree
zpe.sumelectthermal: -1108.833381 hartree
zpe.sumelectthermalent: -1108.832437 hartree
zpe.sumelectthermalfe: -1108.921903 hartree
dipole: 2.2501 2.3069 -2.7093
dipole: 4.2101
quadrupole: -142.5479 -174.8493 -197.9940
quadrupole: 6.2716 15.7257 8.8400
quadrupole: 29.2492 -3.0522 -26.1970 6.2716 15.7257 8.8400
hfenergy: -1109.144516 hartree
pointgroup: C01 [X(C17H15I2N1O5)]
dipole: -0.8694192 -1.3920534 0.2235076 debye
polarizability: 328.013759|-13.235486|214.9152316|-3.641398|-15.1278066|244.4737749 unknown
InChI: InChI=1S/C17H15I2NO5/c1-8(21)11-7-10(2-3-15(11)22)25-16-12(18)4-9(5-13(16)19)6-14(20)17(23)24/h2-5,7,14,22-23H,6,20H2,1H3
charge 0 multiplicity 1
40 atoms
I  0.0446 -1.384275 -3.257737
I  0.558712 -2.680541 2.74123
O  1.348147 -2.22567 -0.38148
O  -2.515619 2.059799 0.375475
O  -4.254436 1.859506 -1.151742
O  5.334056 1.744376 0.064577
O  3.344433 3.532912 0.548806
N  -5.731729 1.006696 1.182985
C  -4.22142 -0.896914 0.380443
C  -4.354335 0.575067 0.950543
C  -2.7817 -1.320869 0.15915
C  -1.985413 -1.744987 1.253269
C  -2.189199 -1.228363 -1.125487
C  -0.010109 -1.904416 -0.203564
C  -0.820809 -1.51945 -1.301586
C  -0.618523 -2.032565 1.071841
C  -3.740488 1.552096 -0.053179
C  2.30825 -1.176073 -0.24897
C  2.955974 1.183218 0.056594
C  1.961482 0.170645 -0.063906
C  3.659845 -1.569226 -0.328819
C  4.327558 0.781289 -0.02764
C  4.65754 -0.587301 -0.219697
C  2.53078 2.609906 0.263712
C  1.036778 2.939865 0.119114
H  -4.798998 -0.940832 -0.56095
H  -4.717966 -1.559858 1.11375
H  -3.783314 0.64144 1.892127
H  -2.433752 -1.847077 2.246692
H  -2.796653 -0.922195 -1.983037
H  -6.227943 0.542049 1.944185
H  -6.285699 1.165667 0.337952
H  0.906466 0.447144 -0.004216
H  3.908034 -2.624275 -0.473013
H  5.712604 -0.884071 -0.283269
H  -2.149611 2.682891 -0.311958
H  0.43324 2.445963 0.904263
H  0.649984 2.617904 -0.86633
H  0.923621 4.030161 0.220173
H  6.223811 1.318064 -0.038504
