program: Gaussian 09
title: 000146739
version: EM64L-G09RevD.01
frameworkgroup: C1[X(C10H13N3O2)]
method: RPBEPBE
basis: SDD
operation: Freq
keyword: #p
keyword: freq=noraman
keyword: PBEPBE/SDD
title: #p freq=noraman PBEPBE/SDD
converged: YES YES NO NO
title: Mulliken charges:
elementType: O O N N N C C C C C C C C C C H H H H H H H H H H H H H
charge: -0.262574 -0.241076 -0.466950 -0.167635 0.033151 0.506695 -0.535228 0.473068 -0.385025 -0.400750 -0.443022 -0.346247 -0.669694 0.315320 -0.624205 0.208966 0.211123 0.234861 0.233788 0.226442 0.295559 0.223497 0.217682 0.221127 0.347933 0.257783 0.257815 0.277600
chargesum: 0.00000
title: Mulliken charges with hydrogens summed into heavy atoms:
elementType: O O N N N C C C C C C C C C C
charge: -0.262574 -0.241076 -0.119018 -0.167635 0.033151 0.506695 -0.115139 0.473068 -0.150164 -0.166962 -0.216581 -0.050688 -0.007389 0.315320 0.168992
polarizability: 2.42436484e+02 4.15576975e+00 1.40471959e+02 -4.21014175e+00 -1.89754969e-01 7.18245676e+01
1716.lowfreq: -13.6138 -4.7531 -1.7796 -0.0008 -0.0008 -0.0002 23.9798 38.5665 49.2144
frequency: 23.8560 38.5039 49.1839 92.6333 94.0323 120.3110 132.9673 186.1002 197.4828 216.6063 251.7852 290.0806 315.2164 352.0941 380.5543 390.7934 406.7909 413.8622 483.9307 520.0888 560.6062 635.1397 687.8104 727.1542 741.7137 764.1850 781.8825 785.0131 827.9219 837.6872 855.1241 858.1429 921.8158 951.1693 967.8230 983.4996 1010.0199 1045.1343 1060.8254 1094.8821 1116.5856 1133.4728 1185.7912 1193.8601 1218.6551 1240.3212 1250.1138 1278.6462 1310.5017 1320.2950 1362.9202 1381.7476 1386.6428 1413.9939 1417.4743 1462.5752 1470.0780 1470.2241 1473.9996 1489.1440 1507.2417 1525.2727 1594.6619 1626.1780 1661.9916 2979.4754 2986.3658 3006.4468 3037.0619 3078.5518 3083.9264 3091.5782 3112.5866 3125.5668 3138.3851 3149.2959 3190.2015 3432.9839
redmass: 2.7225 4.8298 3.8159 4.1159 4.8103 5.1953 1.1024 3.7465 2.5150 1.9344 4.1659 2.9748 4.5397 3.4729 3.8515 6.1432 3.0079 4.3983 10.3274 3.7491 2.7946 6.8937 7.0443 4.2136 3.4463 4.5596 1.2248 1.1802 5.6768 1.3856 6.2924 1.4136 3.0277 1.3653 2.3916 1.3420 2.8517 1.4480 2.0563 4.1345 1.3283 1.3037 2.5357 1.1172 2.1473 1.2611 2.3875 4.4705 1.5449 1.3330 9.0763 4.9659 1.2093 1.4667 2.2170 1.0432 1.0711 1.0439 1.0666 1.0923 2.2750 2.4130 4.6452 6.2935 9.1998 1.0349 1.0598 1.0336 1.1017 1.1001 1.1012 1.1009 1.0876 1.0908 1.0966 1.1010 1.0943 1.0763
irintensity: 0.0174 0.0094 0.7592 5.1067 0.8078 7.4584 0.4011 5.7803 2.4135 5.1100 3.5316 0.1065 3.3671 22.6733 6.4461 1.4246 0.1126 0.8340 3.9720 18.1427 26.8746 0.2053 1.5177 12.3343 8.1899 33.9620 33.5392 6.3941 5.9913 74.3519 56.7932 47.7376 269.5349 2.5474 8.8948 1.7468 0.5689 8.7367 27.8982 106.3272 0.4576 6.2308 19.9545 0.1635 0.0044 0.2807 16.5708 3.9373 2.3554 18.7249 187.2071 24.4872 9.2588 21.4035 68.4457 22.3754 17.7989 13.6865 2.0172 8.1181 0.4232 585.2237 60.4646 5.3107 259.4234 43.3791 40.8949 14.5961 8.1343 63.4801 40.0220 12.6062 15.3484 22.1601 14.2332 0.4205 2.2634 64.8166
temp: 298.150 k
press: 1.00000 atm
elementType: 8 8 7 7 7 6 6 6 6 6 6 6 6 6 6 1 1 1 1 1 1 1 1 1 1 1 1 1
symmnumber: 1
zpe: 579945.0 jmol-1
zpe.correction: 0.220889 hartree
zpe.thermalcorrener: 0.235926 hartree
zpe.thermalcorrenthalpy: 0.236870 hartree
zpe.thermalcorrgfe: 0.177049 hartree
zpe.sumelectzpe: -702.415370 hartree
zpe.sumelectthermal: -702.400333 hartree
zpe.sumelectthermalent: -702.399389 hartree
zpe.sumelectthermalfe: -702.459210 hartree
dipole: 1.8082 -0.0330 0.0000
dipole: 1.8085
quadrupole: -81.7878 -90.7732 -90.7831
quadrupole: -9.5114 -0.3662 0.5620
quadrupole: 5.9935 -2.9918 -3.0017 -9.5114 -0.3662 0.5620
hfenergy: -702.636259 hartree
pointgroup: C01 [X(C10H13N3O2)]
dipole: -0.7112746 0.017903 0.004009 debye
polarizability: 242.5287027|3.3743796|140.3881341|3.3990559|1.4507452|71.8161736 unknown
InChI: InChI=1S/C10H13N3O2/c1-3-8-4-6-9(7-5-8)11-10(14)13(2)12-15/h4-7,11H,3H2,1-2H3
charge 0 multiplicity 1
28 atoms
O  1.77329 -1.966779 -0.038997
O  4.717771 1.561593 0.187356
N  1.034371 0.284309 -0.041328
N  3.339116 -0.210523 0.07989
N  3.501148 1.172092 0.1129
C  -3.233117 0.069262 -0.292759
C  -4.75334 0.018654 -0.333158
C  -0.381891 0.155911 -0.123939
C  -2.543318 1.30762 -0.228525
C  -2.458284 -1.118035 -0.273207
C  -1.138721 1.357178 -0.145027
C  -1.050398 -1.093864 -0.189973
C  -5.381888 -0.015957 1.086638
C  1.969624 -0.722709 -0.006463
C  4.485756 -1.131707 0.127678
H  -5.145512 0.898992 -0.877752
H  -5.084231 -0.876217 -0.894139
H  -3.11212 2.245114 -0.248324
H  -2.966041 -2.088937 -0.328508
H  -0.626668 2.32691 -0.100822
H  -0.472045 -2.019752 -0.180516
H  -5.034309 -0.900817 1.649893
H  -6.485169 -0.055173 1.028191
H  -5.099083 0.882001 1.665583
H  1.42712 1.234392 -0.002107
H  5.057923 -0.97142 1.057591
H  5.157468 -0.939918 -0.726619
H  4.088049 -2.155121 0.087344
