program: Gaussian 09
title: 000146738
version: EM64L-G09RevD.01
frameworkgroup: C1[X(C7H16N8)]
method: RPBEPBE
basis: SDD
operation: Freq
keyword: #pfreq=noraman
keyword: PBEPBE/SDD
title: #p freq=noraman PBEPBE/SDD
converged: YES YES NO NO
title: Mulliken charges:
elementType: N N N N N N N N C C C C C C C H H H H H H H H H H H H H H H H
charge: -0.100267 -0.100795 -0.170720 -0.170296 -0.623065 -0.630047 -0.623392 -0.630905 -0.395196 -0.427371 -0.428074 -0.227956 -0.227333 0.233814 0.233956 0.202741 0.203143 0.230611 0.197745 0.231742 0.198437 0.225052 0.224771 0.326739 0.302029 0.363891 0.294115 0.302123 0.326940 0.363327 0.294240
chargesum: 0.00000
title: Mulliken charges with hydrogens summed into heavy atoms:
elementType: N N N N N N N N C C C C C C C
charge: -0.100267 -0.100795 -0.170720 -0.170296 0.005703 0.027959 0.005670 0.026663 0.010688 0.000986 0.002105 -0.002904 -0.002562 0.233814 0.233956
polarizability: 1.46737926e+02 -2.51837445e+00 2.23545099e+02 -1.85920532e+01 -6.18552414e-01 8.52700377e+01
1716.lowfreq: -5.9668 -0.0006 -0.0006 0.0003 1.0993 7.0622 21.9848 39.4137 49.2807
frequency: 20.5511 39.3966 49.2289 52.6007 88.6930 123.8545 126.3809 137.2648 150.4926 191.7123 240.1826 277.0300 304.1731 305.1780 335.1476 345.4673 355.1933 377.2387 379.4642 422.6700 434.2839 450.6649 479.8458 509.3812 529.1262 538.3213 545.8257 593.3983 605.1786 617.8826 662.9036 710.2217 798.5032 798.7098 821.4002 877.0042 898.2590 902.2654 930.0856 932.5528 978.2798 1000.5327 1030.5499 1035.5867 1045.5975 1060.4172 1075.2046 1103.9646 1127.8125 1137.2466 1181.5795 1205.0837 1252.7021 1292.2314 1307.8665 1327.7679 1346.0189 1346.2899 1448.7384 1451.6206 1463.1529 1479.1389 1480.2711 1537.9379 1538.1684 1580.4051 1599.6226 1608.0378 1609.6042 1630.9610 1637.7643 2961.5232 2966.3895 2980.0425 3006.9326 3008.7765 3026.0341 3056.6586 3059.2270 3452.9452 3453.5441 3541.4301 3542.0200 3643.2114 3643.7209 3689.8555 3690.5032
redmass: 4.3944 5.7789 4.0628 4.2534 4.5069 3.4991 5.8590 4.6299 3.0968 2.2756 2.9212 2.1854 1.4991 2.1887 1.9342 2.5553 2.5250 2.1826 1.9620 1.2766 2.7576 1.4021 2.0707 2.5083 1.6217 1.2906 1.7898 2.7909 3.8249 1.9564 5.1309 2.3251 1.2342 1.5361 2.4175 1.7793 4.6119 3.5541 1.6227 1.7023 2.7062 2.5967 1.8584 1.7926 1.5509 1.6706 3.3215 2.0726 2.1496 1.6391 1.5141 1.4049 1.2118 1.3400 1.2793 1.4832 1.4957 1.5187 1.1000 1.0983 1.1026 2.8249 3.1091 2.1962 2.2117 1.6176 1.5440 2.3872 2.9186 2.1555 2.2205 1.0620 1.0639 1.0632 1.0870 1.0869 1.1020 1.0962 1.0967 1.0498 1.0495 1.0448 1.0449 1.0965 1.0968 1.1032 1.1032
irintensity: 4.8455 0.0102 0.2289 0.4881 0.1086 8.7828 1.4252 25.8684 6.1258 0.6641 0.3014 8.8109 24.2561 86.6030 86.3072 9.8236 0.5402 30.2006 106.6494 466.1234 0.3186 14.2091 8.4290 7.8770 58.1061 291.4947 27.5578 7.1787 0.5001 100.9043 22.0368 312.7701 10.9026 40.0246 8.4550 4.4952 34.0844 15.7547 7.5175 40.9872 3.4676 9.3043 5.0011 9.5691 5.0099 16.1747 0.4089 2.9689 46.7688 18.9566 0.9347 4.8303 1.7689 3.2364 3.2256 30.1176 2.4226 1.8521 6.1353 23.4561 12.1239 25.3515 107.1143 254.8679 223.4986 211.8752 115.5386 18.4387 58.2496 208.8205 789.3069 5.3606 56.2005 91.3626 37.0301 31.4977 24.0212 27.7550 62.8229 74.9158 22.3636 54.0381 40.1587 7.2519 70.5116 26.1850 26.3892
temp: 298.150 k
press: 1.00000 atm
elementType: 7 7 7 7 7 7 7 7 6 6 6 6 6 6 6 1 1 1 1 1 1 1 1 1 1 1 1 1 1 1 1
symmnumber: 1
zpe: 667520.4 jmol-1
zpe.correction: 0.254245 hartree
zpe.thermalcorrener: 0.271585 hartree
zpe.thermalcorrenthalpy: 0.272529 hartree
zpe.thermalcorrgfe: 0.208051 hartree
zpe.sumelectzpe: -713.128939 hartree
zpe.sumelectthermal: -713.111599 hartree
zpe.sumelectthermalent: -713.110655 hartree
zpe.sumelectthermalfe: -713.175133 hartree
dipole: 0.1805 -4.8745 0.0590
dipole: 4.8782
quadrupole: -85.6937 -57.9579 -90.6537
quadrupole: -0.8576 -9.1386 -0.3153
quadrupole: -7.5919 20.1439 -12.5520 -0.8576 -9.1386 -0.3153
hfenergy: -713.3831841 hartree
pointgroup: C01 [X(C7H16N8)]
dipole: 0.0611391 -1.9182056 0.0122574 debye
polarizability: 145.5293174|-2.0127662|223.5717186|-20.4323025|0.1988372|86.4520267 unknown
InChI: InChI=1S/C7H16N8/c8-6(9)14-12-4-2-1-3-5-13-15-7(10)11/h4-5H,1-3,8-11H2
charge 0 multiplicity 1
31 atoms
N  -1.907601 0.36258 -0.467683
N  1.895543 0.394503 0.449337
N  -3.010457 -0.291349 0.172629
N  3.017606 -0.198215 -0.217259
N  -3.860861 -2.430708 0.597328
N  -1.67324 -2.241248 -0.309155
N  3.973935 -2.286825 -0.667077
N  1.804499 -2.219719 0.298096
C  -0.060834 3.340941 0.030287
C  -0.837575 2.498049 -1.022421
C  0.737083 2.473394 1.045407
C  -1.939175 1.670413 -0.407613
C  1.861174 1.702645 0.398389
C  -2.829151 -1.620027 0.139307
C  2.911268 -1.534655 -0.180868
H  0.633201 4.023593 -0.500143
H  -0.772143 3.981717 0.589276
H  -0.140883 1.824931 -1.554452
H  -1.274522 3.19084 -1.771448
H  0.059143 1.760214 1.548538
H  1.155785 3.144658 1.824369
H  -2.763015 2.193253 0.114731
H  2.648495 2.268804 -0.135258
H  -4.698716 -1.944333 0.910923
H  -3.663643 -3.355235 0.972709
H  -0.990258 -1.580104 -0.696674
H  -1.694571 -3.198761 -0.652673
H  3.819732 -3.222413 -1.035044
H  4.774677 -1.755018 -1.002946
H  1.096254 -1.598398 0.705512
H  1.889454 -3.174727 0.638676
