program: Gaussian 09
title: 000146732
version: EM64L-G09RevD.01
frameworkgroup: C1[X(C13H9N3O2)]
method: RPBEPBE
basis: SDD
operation: Freq
keyword: #p
keyword: freq=noraman
keyword: PBEPBE/SDD
title: #p freq=noraman PBEPBE/SDD
converged: YES YES YES YES
title: Mulliken charges:
elementType: O O N N N C C C C C C C C C C C C C H H H H H H H H H
charge: -0.211764 -0.229681 -0.033898 -0.672139 0.015409 0.350724 0.275511 0.285397 -0.142489 -0.085994 -0.503585 -0.272142 0.361754 -0.343135 -0.311802 -0.398556 -0.276300 -0.226884 0.249500 0.273344 0.192909 0.271052 0.289188 0.233653 0.237045 0.341022 0.331861
chargesum: 0.00000
title: Mulliken charges with hydrogens summed into heavy atoms:
elementType: O O N N N C C C C C C C C C C C C C
charge: -0.211764 -0.229681 -0.033898 0.000744 0.015409 0.350724 0.275511 0.285397 -0.142489 -0.085994 -0.254085 0.001202 0.361754 -0.150226 -0.040750 -0.109368 -0.042646 0.010161
polarizability: 3.73390565e+02 -9.30896618e+00 1.86672441e+02 -5.87027192e-03 -1.10716757e-02 6.35137337e+01
1716.lowfreq: -6.7255 -4.8490 -0.0008 -0.0006 0.0004 4.7679 44.6323 60.0162 90.5358
frequency: 44.6272 60.0082 90.5314 141.1379 143.0913 159.5878 259.1372 263.1372 297.4631 336.1408 336.1526 373.1487 408.3831 434.1812 470.2807 494.6652 503.4048 512.1614 518.7082 530.4576 569.1135 572.4691 619.7354 645.5158 656.8047 699.3675 702.2954 747.7847 760.1977 766.9058 802.8386 834.3720 857.7370 861.0234 870.1818 914.2996 926.7198 953.5907 996.5460 1003.4729 1022.6503 1075.7053 1110.8251 1116.8047 1123.3554 1157.2509 1175.5715 1202.7667 1234.0858 1255.3167 1274.0780 1313.4205 1344.8477 1364.8461 1382.0840 1400.1146 1443.9564 1448.9757 1467.0136 1495.7762 1530.9940 1551.9303 1562.5978 1610.2820 1628.8531 1657.2218 3112.1244 3139.8252 3146.3292 3159.4519 3166.3182 3173.9391 3191.6417 3568.6856 3700.1081
redmass: 6.4180 10.9715 4.0180 8.3700 3.9085 6.0287 6.4390 4.7809 9.1382 5.8843 4.1373 1.2196 3.1556 6.1511 7.0423 1.5659 1.5993 3.9604 7.1613 7.0135 3.5910 4.9161 7.1984 5.2201 6.7925 7.2816 6.4894 3.3158 1.4653 7.6416 2.3611 3.7366 1.6651 6.0213 1.8834 1.6896 4.1746 1.3709 1.3374 1.3170 2.3093 2.2712 2.3641 2.6109 1.5066 1.5444 1.2833 6.7032 1.4716 3.2065 1.5357 4.7040 2.7107 4.7638 5.1888 5.0070 3.3381 2.6798 4.0560 4.4018 7.5061 6.7198 8.2858 6.3044 6.7493 1.2196 1.0872 1.0881 1.0904 1.0943 1.0890 1.0995 1.0970 1.0456 1.1028
irintensity: 1.9530 0.2998 0.0202 2.3213 9.0298 3.0427 1.2575 0.3187 0.4927 0.6000 2.6053 0.2160 5.9323 2.2301 2.7749 117.7823 76.6483 1.0076 0.0639 3.6215 23.2273 1.5961 0.3737 49.3205 10.8021 2.6934 5.1541 0.0745 97.5220 12.3069 4.8801 2.0177 28.1391 0.2090 15.8070 25.8055 2.6211 1.4355 0.6694 0.1704 10.3581 16.0123 7.1333 23.3577 9.0541 9.0557 15.4983 811.3677 23.0530 26.7420 4.6251 53.8309 21.2703 60.9480 52.5124 67.1219 4.6258 10.0563 32.3633 117.6392 72.2902 34.7024 31.6300 183.3662 14.3453 283.5560 12.2687 9.9815 0.1447 20.9240 3.7569 24.7013 2.5407 74.1098 25.6758
temp: 298.150 k
press: 1.00000 atm
elementType: 8 8 7 7 7 6 6 6 6 6 6 6 6 6 6 6 6 6 1 1 1 1 1 1 1 1 1
symmnumber: 1
zpe: 517068.6 jmol-1
zpe.correction: 0.196941 hartree
zpe.thermalcorrener: 0.210621 hartree
zpe.thermalcorrenthalpy: 0.211566 hartree
zpe.thermalcorrgfe: 0.156305 hartree
zpe.sumelectzpe: -814.200279 hartree
zpe.sumelectthermal: -814.186599 hartree
zpe.sumelectthermalent: -814.185655 hartree
zpe.sumelectthermalfe: -814.240915 hartree
dipole: -6.6276 3.2621 0.0003
dipole: 7.3869
quadrupole: -119.4805 -89.1190 -107.4351
quadrupole: -10.8021 0.0028 -0.0004
quadrupole: -14.1356 16.2259 -2.0902 -10.8021 0.0028 -0.0004
hfenergy: -814.3972205 hartree
pointgroup: C01 [X(C13H9N3O2)]
dipole: -2.6006553 -1.2972516 -0.0001148 debye
polarizability: 373.2863721|10.3005192|186.776634|0.005929|-0.0110403|63.5137337 unknown
InChI: InChI=1S/C13H9N3O2/c14-13-9-3-1-2-4-11(9)15-12-6-5-8(16(17)18)7-10(12)13/h1-7H,14H2
charge 0 multiplicity 1
27 atoms
O  5.141573 0.504942 0.000173
O  4.366248 -1.643804 0.00047
N  -1.112788 1.669679 -0.000082
N  -0.545398 -2.578189 0.000248
N  4.179024 -0.35993 0.000092
C  0.39733 -0.315698 0.000088
C  -2.057302 -0.647942 0.000101
C  -0.73205 -1.21413 0.000146
C  0.136384 1.122895 -0.000009
C  -2.182269 0.801995 -0.000039
C  1.747197 -0.771876 0.000121
C  1.262551 2.025213 -0.000049
C  2.796006 0.148381 0.000072
C  -3.252551 -1.443186 0.000181
C  -3.497467 1.380619 -0.000126
C  2.569687 1.563761 -0.000008
C  -4.514224 -0.848958 0.000104
C  -4.636735 0.579133 -0.000061
H  2.022664 -1.831648 0.000174
H  1.031391 3.094176 -0.000111
H  -3.19959 -2.539059 0.000322
H  -3.555747 2.4731 -0.000242
H  3.428966 2.23838 -0.000041
H  -5.414415 -1.472294 0.000175
H  -5.631904 1.036634 -0.000131
H  0.38499 -2.986429 0.00031
H  -1.334672 -3.217265 0.000221
