program: Gaussian 09
title: 000146836
version: EM64L-G09RevD.01
frameworkgroup: C1[X(C20H25N3O3S2)]
method: RPBEPBE
basis: SDD
operation: Freq
keyword: #p
keyword: freq=noraman
keyword: PBEPBE/SDD
title: #p freq=noraman PBEPBE/SDD
converged: YES YES NO NO
title: Mulliken charges:
elementType: S S O O O N N N C C C C C C C C C C C C C C C C C C C C H H H H H H H H H H H H H H H H H H H H H H H H H
charge: 0.903457 0.324465 -0.286184 -0.508649 -0.497528 -0.096081 -0.372383 -0.313205 -0.384561 -0.354592 -0.393379 -0.390298 -0.403038 -0.483866 0.477292 -0.510545 -0.474930 0.378100 -0.402791 -0.397990 0.418641 0.231940 -0.195424 -0.270666 0.097465 -0.405573 -0.706248 -0.632523 0.170546 0.273230 0.204538 0.163679 0.186920 0.218002 0.186428 0.195932 0.187873 0.205020 0.216432 0.193107 0.282900 0.232306 0.190499 0.227437 0.289148 0.226813 0.221332 0.230080 0.214375 0.244580 0.307006 0.279039 0.301870
chargesum: 0.00000
title: Mulliken charges with hydrogens summed into heavy atoms:
elementType: S S O O O N N N C C C C C C C C C C C C C C C C C C C C
charge: 0.903457 0.324465 -0.286184 -0.508649 -0.497528 -0.096081 -0.065377 -0.313205 0.059215 0.013625 0.011543 -0.007938 -0.010145 -0.074327 0.477292 -0.227645 -0.242624 0.378100 0.015146 0.117971 0.418641 0.231940 0.025909 0.173789 0.097465 -0.160993 -0.427209 -0.330653
polarizability: 3.01805223e+02 -1.19550157e+01 2.95358366e+02 4.52430628e+01 6.07600216e+00 2.60827163e+02
1716.lowfreq: -10.3875 -4.8418 0.0019 0.0019 0.0021 4.6443 8.7529 13.3788 20.7518
frequency: 7.6491 11.9047 20.2094 41.4841 43.0060 45.8829 60.4901 69.1160 85.9051 90.4738 97.9163 111.1923 156.5978 162.8981 169.2736 190.8903 203.9231 229.6143 237.9053 240.4498 247.4161 270.3978 287.7085 290.9533 310.6798 313.0136 333.9389 374.1769 389.9142 404.2321 406.6078 418.2877 425.8946 445.4093 446.6705 458.2625 462.6041 469.4094 498.6568 534.6357 550.2302 562.6118 582.7702 590.4400 609.1058 656.2882 695.0457 700.4199 721.3573 731.8672 737.7689 761.7454 770.3363 788.6305 791.1979 793.8013 804.4997 819.3224 835.6260 851.8191 853.7184 860.2567 878.5870 896.4342 910.1679 914.7314 936.9706 956.5525 962.0765 968.8618 971.6461 984.8254 989.6548 995.6732 1001.2823 1048.1628 1059.3675 1075.9415 1079.6516 1084.7755 1100.4118 1111.9467 1122.8649 1133.2483 1142.1609 1150.5436 1158.3614 1159.4182 1172.1730 1192.2298 1198.3552 1213.5262 1242.6863 1249.3678 1263.0967 1269.9395 1275.5434 1289.2612 1293.5282 1295.7830 1327.2961 1333.8754 1337.2206 1345.3532 1349.2173 1350.8645 1359.2484 1363.7857 1374.7737 1383.2987 1396.5021 1438.4638 1440.9869 1449.0741 1455.0863 1458.0550 1458.5299 1465.2862 1470.4322 1473.7103 1477.7594 1484.2006 1484.9701 1525.0000 1533.9701 1547.6978 1603.8557 1608.2532 2815.8462 2830.6659 2846.1244 2962.9179 2963.2870 2975.5453 2977.4877 2986.8669 2993.1306 3010.8969 3012.7169 3025.9483 3027.1766 3042.0302 3057.4846 3059.8616 3063.0085 3090.3206 3119.3531 3141.5035 3150.6101 3166.8311 3224.5105 3250.8868 3563.0533
redmass: 6.2155 5.5300 5.9403 4.1480 5.3881 6.0536 4.7501 4.2027 8.3696 9.3067 6.7569 3.2993 5.2506 3.2583 6.1149 2.9823 3.4288 6.4828 4.0883 2.2841 3.8606 6.5967 3.2696 2.8807 3.8193 2.3368 10.0489 2.9296 1.8092 18.5879 2.9747 3.2235 3.6305 3.0361 2.8910 4.0508 3.0831 1.7820 3.3955 5.2097 3.1109 2.5333 7.4431 5.3895 4.0568 7.8444 2.2852 1.7851 4.0288 6.5139 2.4645 3.2424 4.3744 1.5892 1.4615 3.6821 1.4891 2.5713 10.8687 1.9649 1.7485 3.2079 1.5111 1.8074 2.4116 1.6841 3.5574 1.2968 17.1530 1.4029 2.5864 4.1214 2.1684 2.5938 2.5592 2.1242 2.6670 1.6275 1.4231 1.9776 2.4054 2.1907 2.6659 1.7310 1.7643 1.3665 1.2419 1.9544 1.2421 1.3184 1.1200 1.3139 2.1378 1.5925 1.2915 1.3231 1.9775 1.3270 1.3727 1.2671 1.3041 1.4289 1.4864 1.5005 3.5486 1.2845 1.5570 1.4796 1.6415 1.5313 3.7074 2.4349 1.0987 1.0937 1.1338 1.1242 1.1637 1.1008 1.2949 1.3401 1.8147 1.2205 1.2519 6.3025 5.7848 5.2319 6.8753 6.3936 1.0706 1.0712 1.0695 1.0614 1.0568 1.0841 1.0642 1.0641 1.0622 1.0871 1.0640 1.1054 1.0959 1.1027 1.1002 1.0996 1.0891 1.1021 1.0870 1.0925 1.0904 1.0974 1.0962 1.0982 1.0772
irintensity: 1.5716 1.0057 0.3345 1.5118 1.1422 0.8345 1.1348 0.2714 0.3416 0.5421 3.5910 1.6834 3.2999 0.8344 0.4238 2.7033 1.6298 1.2493 4.4079 2.1717 0.5239 2.2346 1.0300 0.5296 2.9092 2.0561 4.3197 6.1071 2.2105 55.5760 16.6493 34.0503 13.7173 2.6890 0.6850 16.9759 4.1978 64.7095 28.8732 17.4359 0.1069 0.4069 24.4488 4.0969 0.1565 2.6662 19.5324 11.4199 11.1137 7.6253 4.1115 5.4432 14.3423 54.2750 78.7105 11.4334 1.0863 20.5068 110.5129 2.6143 5.9387 2.0017 6.6007 9.3276 2.3976 7.0539 18.1160 8.6490 116.6396 4.4742 60.0900 4.8271 16.3716 21.7746 21.8650 6.9978 32.5490 19.3066 1.3441 5.8109 7.6040 12.2994 5.6388 1.2094 45.5295 21.0335 1.9090 70.2793 12.8703 3.6420 1.3765 29.6181 85.3542 29.0698 11.8397 13.9977 30.1158 20.4593 8.2293 24.2546 16.6722 9.3666 2.6997 0.6875 25.8378 15.4594 14.8131 10.4283 8.2201 4.0481 21.2440 40.3909 14.7498 11.8276 17.5887 44.3427 25.6758 10.7332 50.8198 19.3337 16.9641 2.8655 2.0263 75.6793 193.7603 142.2472 33.8635 95.7446 69.9093 51.3208 187.2853 49.9044 23.1360 32.0589 25.1410 35.4099 31.1550 71.0083 50.2291 41.7980 65.0144 66.3673 46.4913 43.9808 24.4100 6.3164 7.8450 29.3954 5.7079 16.5324 1.0859 8.0187 29.8704
temp: 298.150 k
press: 1.00000 atm
elementType: 16 16 8 8 8 7 7 7 6 6 6 6 6 6 6 6 6 6 6 6 6 6 6 6 6 6 6 6 1 1 1 1 1 1 1 1 1 1 1 1 1 1 1 1 1 1 1 1 1 1 1 1 1
symmnumber: 1
zpe: 1103789.2 jmol-1
zpe.correction: 0.420411 hartree
zpe.thermalcorrener: 0.447793 hartree
zpe.thermalcorrenthalpy: 0.448737 hartree
zpe.thermalcorrgfe: 0.358719 hartree
zpe.sumelectzpe: -1960.862384 hartree
zpe.sumelectthermal: -1960.835003 hartree
zpe.sumelectthermalent: -1960.834058 hartree
zpe.sumelectthermalfe: -1960.924077 hartree
dipole: -5.3479 0.0907 -7.3028
dipole: 9.0521
quadrupole: -154.5321 -172.9065 -184.2856
quadrupole: 4.0973 20.0380 10.2907
quadrupole: 16.0426 -2.3317 -13.7109 4.0973 20.0380 10.2907
hfenergy: -1961.2827952 hartree
pointgroup: C01 [X(C20H25N3O3S2)]
dipole: 0.9484446 1.0099434 3.2808061 debye
polarizability: 265.5051551|2.525912|306.4366806|43.5517252|19.7565265|286.0489159 unknown
InChI: InChI=1S/C20H25N3O3S2/c24-28(25)19-15-27-14-18(19)20(22-28)21-8-5-11-26-17-7-4-6-16(12-17)13-23-9-2-1-3-10-23/h4,6-7,12,14-15,21H,1-3,5,8-11,13H2
charge 0 multiplicity 1
53 atoms
S  2.080014 1.584062 -1.10604
S  3.625989 4.602072 1.860173
O  0.428652 -2.902828 1.011948
O  0.511616 1.858238 -1.404331
O  3.109189 1.455568 -2.346216
N  -3.627232 0.089271 -0.403512
N  2.992373 -0.202264 2.355761
N  2.265873 0.108842 0.127911
C  -2.720744 1.04914 -1.092821
C  -4.939117 0.710715 -0.092079
C  -2.481145 2.302384 -0.230112
C  -4.767011 1.954537 0.803597
C  -3.818263 2.980766 0.141293
C  -3.782498 -1.176258 -1.156215
C  -2.530157 -2.050415 -1.156875
C  -1.644625 -2.020359 -0.052171
C  -2.274058 -2.929421 -2.234479
C  -0.512375 -2.865001 -0.036556
C  1.494762 -2.137717 3.011001
C  2.808483 -1.670168 2.338374
C  3.026515 2.076504 1.387833
C  2.748803 0.61293 1.282256
C  -1.144341 -3.781877 -2.201357
C  0.264442 -1.947936 2.11704
C  2.733523 2.813495 0.193872
C  -0.25814 -3.755791 -1.107599
C  3.520425 2.888849 2.395666
C  2.978477 4.15866 0.229029
H  -3.158762 1.358497 -2.079293
H  -1.757843 0.553564 -1.302114
H  -5.571029 -0.041905 0.418137
H  -5.475167 1.013768 -1.032043
H  -1.947767 1.999665 0.692441
H  -1.814392 2.990994 -0.780041
H  -5.759338 2.405142 1.001372
H  -4.34266 1.634901 1.775831
H  -4.295425 3.381042 -0.77783
H  -3.648436 3.841663 0.8166
H  -4.608724 -1.742276 -0.677686
H  -4.097208 -0.998525 -2.217357
H  -1.868209 -1.314208 0.753857
H  -2.948975 -2.943922 -3.098708
H  1.343546 -1.60257 3.969345
H  1.586038 -3.21482 3.24741
H  2.814415 -1.998595 1.285439
H  3.677041 -2.124025 2.85028
H  -0.945727 -4.459804 -3.039138
H  0.20442 -0.9161 1.717802
H  -0.668387 -2.172393 2.673892
H  0.630181 -4.393755 -1.070423
H  3.313353 0.229367 3.222901
H  3.84084 2.644695 3.407524
H  2.849085 4.930302 -0.525787
