program: Gaussian 09
title: 000146731
version: EM64L-G09RevD.01
frameworkgroup: C1[X(C15H12N2O)]
method: RPBEPBE
basis: SDD
operation: Freq
keyword: #p
keyword: freq=noraman
keyword: PBEPBE/SDD
title: #p freq=noraman PBEPBE/SDD
converged: NO YES NO NO
title: Mulliken charges:
elementType: O N N C C C C C C C C C C C C C C C H H H H H H H H H H H H
charge: -0.246777 -0.024460 -0.450436 0.221567 -0.085201 0.417334 0.352115 -0.382150 -0.106820 -0.350564 -0.390328 -0.404558 -0.210917 -0.304754 -0.251636 -0.226349 0.213377 -0.803510 0.202952 0.267550 0.310672 0.230944 0.232434 0.266708 0.310354 0.231186 0.233788 0.238693 0.271839 0.236946
chargesum: 0.00000
title: Mulliken charges with hydrogens summed into heavy atoms:
elementType: O N N C C C C C C C C C C C C C C C
charge: -0.246777 -0.024460 -0.140082 0.221567 -0.085201 0.417334 0.352115 -0.179197 -0.106820 -0.083014 -0.079656 -0.173614 0.021517 -0.038046 -0.020450 0.007438 0.213377 -0.056032
polarizability: 3.18546562e+02 2.60406622e+01 2.14536476e+02 -1.41295974e-02 -8.49796268e-03 7.32511083e+01
1716.lowfreq: -73.6245 -5.0279 -4.0980 -0.0011 -0.0008 -0.0007 9.0384 32.1915 51.5197
frequency: -73.6128 32.1246 51.5140 99.4033 108.7512 112.1484 206.8748 224.1726 254.4263 270.6956 301.8363 338.2856 402.4355 407.4567 450.6929 460.4159 498.0930 516.5230 531.3547 553.1794 579.4840 600.3522 606.5700 630.0486 638.1879 660.1688 737.1434 747.0797 757.4493 787.5046 799.0486 834.3778 836.7487 857.9315 895.3410 900.7619 913.1445 940.3114 967.1528 972.4508 995.6697 997.1731 1008.5411 1030.0076 1032.1084 1072.3949 1126.0996 1161.4262 1175.9125 1206.5391 1233.6523 1237.5805 1270.1198 1276.4139 1295.1921 1338.2661 1364.8914 1376.2977 1382.1537 1405.5562 1426.4965 1447.0308 1461.9848 1468.1096 1468.8943 1510.8422 1532.9405 1557.9941 1571.9112 1611.7030 1631.7051 1642.1236 2986.3096 3071.6090 3093.5942 3115.6982 3135.5305 3136.6533 3142.4955 3155.4533 3170.8571 3176.2029 3195.1836 3546.7632
redmass: 1.0946 4.6591 4.3152 5.1597 4.5677 3.5424 3.8019 6.2375 4.2502 5.7003 4.1926 3.9891 5.7150 3.9551 6.1292 2.6637 3.4868 4.5369 6.6797 2.8372 2.6743 1.6214 7.0528 7.5482 3.3870 6.0563 6.0932 1.7071 1.8268 1.9055 5.0676 2.2021 4.3969 1.4500 2.0117 6.2766 5.9040 1.3571 1.3679 1.9564 1.3298 1.3311 2.2066 1.6585 2.7072 1.9236 1.6433 1.1506 1.1337 1.9333 2.0051 2.1358 3.9458 1.9165 2.6877 3.2052 2.4723 1.2443 2.3982 3.6303 4.5131 1.2671 2.5196 2.6929 1.0487 2.0936 6.4085 7.2579 5.3406 6.3541 7.0092 4.4710 1.0384 1.0985 1.0902 1.0879 1.0978 1.0886 1.0884 1.0947 1.0994 1.0959 1.0945 1.0755
irintensity: 0.0652 9.2823 0.4328 4.4605 2.1446 0.9644 0.0031 9.1804 0.1280 1.1666 3.9018 2.2056 0.3511 0.0394 0.8103 3.6867 0.0698 23.6666 1.0593 9.9009 2.6327 50.6407 3.4470 5.1236 13.4450 0.6927 0.7507 49.0879 22.9897 1.3514 0.8013 68.0247 2.1109 39.3233 16.6080 1.0094 1.0104 3.5909 3.5053 29.0506 0.0297 6.2259 6.5197 7.7799 2.8530 8.7995 12.7523 1.3613 5.9195 29.3589 33.0052 13.2483 16.0403 20.1429 39.8619 113.1206 32.0143 50.3160 4.0557 91.6007 106.9153 40.1073 32.6720 70.4827 20.7072 384.6582 33.8979 32.9716 17.1082 64.8443 16.9468 122.8982 6.8213 14.6781 23.6158 6.5052 7.8828 10.8125 13.1950 22.8687 28.8192 11.5785 5.2017 15.7702
temp: 298.150 k
press: 1.00000 atm
elementType: 8 7 7 6 6 6 6 6 6 6 6 6 6 6 6 6 6 6 1 1 1 1 1 1 1 1 1 1 1 1
symmnumber: 1
zpe: 608454.9 jmol-1
zpe.correction: 0.231748 hartree
zpe.thermalcorrener: 0.245490 hartree
zpe.thermalcorrenthalpy: 0.246434 hartree
zpe.thermalcorrgfe: 0.190401 hartree
zpe.sumelectzpe: -762.319908 hartree
zpe.sumelectthermal: -762.306166 hartree
zpe.sumelectthermalent: -762.305222 hartree
zpe.sumelectthermalfe: -762.361255 hartree
dipole: -1.6802 -4.5408 0.0045
dipole: 4.8417
quadrupole: -109.0464 -88.8247 -109.7176
quadrupole: -2.1175 0.0218 -0.0041
quadrupole: -6.5169 13.7049 -7.1881 -2.1175 0.0218 -0.0041
hfenergy: -762.5516561 hartree
pointgroup: C01 [X(C15H12N2O1)]
dipole: -0.7222219 -1.7626469 0.001776 debye
polarizability: 320.2170467|22.3959439|212.8659915|-0.0144141|-0.0080059|73.2511083 unknown
InChI: InChI=1S/C15H12N2O/c1-10(18)16-14-7-4-8-15-12(14)9-11-5-2-3-6-13(11)17-15/h2-9,16H,1H3
charge 0 multiplicity 1
30 atoms
O  4.756942 -0.403569 -0.001831
N  -1.699103 1.647109 0.000317
N  2.483582 -1.01592 -0.001113
C  0.365957 0.246581 -0.000327
C  -0.332415 1.538249 0.000105
C  -1.854381 -0.828139 -0.000226
C  1.824513 0.244089 -0.000549
C  -0.440416 -0.91765 -0.000445
C  -2.452145 0.504009 0.000138
C  0.431019 2.755221 0.000366
C  2.526522 1.455755 -0.000263
C  -2.714146 -1.981409 -0.00034
C  1.820074 2.701757 0.000186
C  -3.886717 0.6211 0.000365
C  -4.097952 -1.830441 -0.000099
C  -4.687886 -0.517352 0.000244
C  3.859089 -1.292365 -0.000985
C  4.176137 -2.789843 -0.000091
H  -0.006512 -1.926463 -0.00066
H  -0.120785 3.698912 0.000663
H  3.617332 1.437413 -0.00054
H  -2.26459 -2.982324 -0.00061
H  2.403337 3.629082 0.000355
H  -4.311351 1.629552 0.000638
H  1.88187 -1.840537 -0.001538
H  -4.747579 -2.712547 -0.000182
H  -5.779126 -0.419232 0.000435
H  3.781045 -3.283574 0.907348
H  5.268182 -2.914493 -0.02046
H  3.745406 -3.29497 -0.884703
