program: Gaussian 09
title: 000146720
version: EM64L-G09RevD.01
frameworkgroup: C1[X(C13H11N3)]
method: RPBEPBE
basis: SDD
operation: Freq
keyword: #pfreq=noraman
keyword: PBEPBE/SDD
title: #p freq=noraman PBEPBE/SDD
converged: NO YES NO NO
title: Mulliken charges:
elementType: N N N C C C C C C C C C C C C C H H H H H H H H H H H
charge: -0.025435 -0.702988 -0.702561 0.257409 0.496980 -0.063181 -0.159970 -0.423932 0.354961 -0.624670 -0.293674 -0.378648 0.519210 -0.463353 -0.420678 -0.200359 0.205267 0.219679 0.260734 0.259826 0.211479 0.219638 0.220200 0.310282 0.308403 0.308670 0.306712
chargesum: 0.00000
title: Mulliken charges with hydrogens summed into heavy atoms:
elementType: N N N C C C C C C C C C C C C C
charge: -0.025435 -0.084302 -0.087179 0.257409 0.496980 -0.063181 -0.159970 -0.218665 0.354961 -0.404992 -0.032940 -0.118822 0.519210 -0.251875 -0.201040 0.019841
polarizability: 3.30365894e+02 3.15169580e+00 1.76335057e+02 9.60554911e-03 1.24858570e-02 6.37283681e+01
1716.lowfreq: -0.0006 -0.0003 0.0006 4.6909 6.3435 7.0607 60.2089 85.1093 151.7158
frequency: 60.2054 85.1088 151.7144 175.0366 232.4947 241.9409 263.4533 300.2395 341.8939 342.0105 348.7720 380.6842 403.8994 409.6580 423.6622 465.7956 466.9492 510.4583 519.2584 535.0036 588.0778 597.3416 645.2629 646.2221 695.3994 737.9025 760.1415 773.3986 815.3498 830.4202 831.2038 833.8065 845.8470 869.7971 898.2909 942.7496 967.2779 972.4283 979.0764 1040.9726 1069.6634 1097.7094 1139.3637 1165.3631 1215.4626 1230.2236 1248.3174 1274.3098 1306.7879 1336.2419 1347.7639 1383.7797 1387.4334 1415.2310 1447.5536 1473.1345 1497.4433 1537.3565 1565.7931 1577.9163 1611.7804 1638.1707 1641.4075 1652.3108 3103.3226 3106.7947 3116.1189 3118.2290 3140.4567 3164.2587 3175.6224 3566.7041 3577.3034 3707.1503 3716.9420
redmass: 3.7102 4.3376 3.5262 4.4789 3.3046 2.1027 2.1572 3.8636 1.6026 5.2975 1.4389 1.3541 1.2437 3.5996 3.1976 2.7338 3.7558 5.6225 6.2743 3.8245 3.2302 7.5447 3.6568 6.0408 6.9764 1.7307 6.0093 1.9625 2.2145 5.3395 1.9162 1.7737 4.3300 1.5029 2.0098 2.7460 1.3163 1.3441 2.1693 1.6042 2.1225 1.5567 1.3307 1.1724 1.5034 2.2154 2.4824 1.7919 2.6562 3.2800 3.1973 2.4183 4.3005 5.7483 3.9462 4.4635 4.0196 7.0074 6.7909 5.0229 5.9641 1.4462 1.2035 3.2295 1.0905 1.0903 1.0875 1.0891 1.0923 1.0957 1.0966 1.0449 1.0453 1.1040 1.1029
irintensity: 0.5502 8.1447 6.7347 2.9335 11.8714 34.1751 39.5750 3.2608 2.7162 1.4776 319.1778 26.6505 161.6863 0.4484 0.3434 5.8131 4.1336 2.7284 5.6539 0.0054 0.4223 7.8387 1.8454 1.4445 2.5865 35.8386 2.4254 14.5158 19.8407 4.4536 28.4765 57.7643 7.0153 0.0037 60.0535 2.7895 2.6924 0.6687 2.4669 4.6223 5.0977 25.5266 33.8083 3.9851 30.5769 1.0178 16.3150 0.9798 61.5238 36.0614 24.7177 30.8149 3.0410 5.2390 58.0390 47.1152 119.6747 7.6180 65.5673 51.3574 3.5004 117.3931 171.7905 423.4532 5.0102 40.1875 29.5968 23.2137 30.4751 14.0642 18.6630 123.1018 58.0609 21.4534 17.9014
temp: 298.150 k
press: 1.00000 atm
elementType: 7 7 7 6 6 6 6 6 6 6 6 6 6 6 6 6 1 1 1 1 1 1 1 1 1 1 1
symmnumber: 1
zpe: 554365.2 jmol-1
zpe.correction: 0.211147 hartree
zpe.thermalcorrener: 0.224044 hartree
zpe.thermalcorrenthalpy: 0.224988 hartree
zpe.thermalcorrgfe: 0.172740 hartree
zpe.sumelectzpe: -665.167901 hartree
zpe.sumelectthermal: -665.155004 hartree
zpe.sumelectthermalent: -665.154060 hartree
zpe.sumelectthermalfe: -665.206308 hartree
dipole: 2.4858 4.8989 0.0055
dipole: 5.4935
quadrupole: -58.4524 -79.1532 -101.6001
quadrupole: -2.9748 0.0088 0.0142
quadrupole: 21.2828 0.5820 -21.8649 -2.9748 0.0088 0.0142
hfenergy: -665.3790477 hartree
pointgroup: C01 [X(C13H11N3)]
dipole: 0.9880223 -1.9222551 -0.0021798 debye
polarizability: 330.3945778|-2.3482276|176.3063729|-0.0096705|0.0124356|63.7283681 unknown
InChI: InChI=1S/C13H11N3/c14-9-4-5-12-8(6-9)7-10-11(15)2-1-3-13(10)16-12/h1-7H,14-15H2
charge 0 multiplicity 1
27 atoms
N  -0.126506 1.643393 0.000087
N  -2.795114 -2.535572 -0.000298
N  4.795055 -1.105879 0.000004
C  -1.385803 -0.50091 -0.000065
C  1.08169 -0.534326 -0.000101
C  -1.321034 0.965119 0.000096
C  1.037191 0.926757 -0.000045
C  -0.164476 -1.214772 -0.000093
C  -2.69517 -1.142851 -0.000157
C  2.346313 -1.206105 -0.000189
C  2.287157 1.642658 -0.000073
C  -2.533028 1.734495 0.000329
C  3.547833 -0.480012 -0.000188
C  -3.851571 -0.344338 0.000091
C  3.497999 0.968381 -0.00012
C  -3.763906 1.082062 0.000375
H  -0.146293 -2.31238 0.000004
H  2.367835 -2.303997 -0.000211
H  2.240063 2.735973 -0.000025
H  -2.445536 2.823962 0.000488
H  -4.838008 -0.82459 0.000051
H  4.440785 1.530487 -0.000072
H  -4.691902 1.665579 0.000569
H  -1.977135 -3.134228 -0.00163
H  -3.709507 -2.977656 -0.000593
H  5.651086 -0.559729 -0.000871
H  4.870982 -2.118717 -0.000562
