program: Gaussian 09
title: 000146759
version: EM64L-G09RevD.01
frameworkgroup: C1[X(C15H28O11)]
method: RPBEPBE
basis: SDD
operation: Freq
keyword: #p
keyword: freq=noraman
keyword: PBEPBE/SDD
title: #p freq=noraman PBEPBE/SDD
converged: YES YES NO NO
title: Mulliken charges:
elementType: O O O O O O O O O O O C C C C C C C C C C C C C C C H H H H H H H H H H H H H H H H H H H H H H H H H H H H
charge: -0.275045 -0.227032 -0.289759 -0.517298 -0.273873 -0.489510 -0.461248 -0.430308 -0.421828 -0.415176 -0.439455 -0.083362 -0.087464 -0.039568 -0.022413 -0.157299 -0.198134 -0.066719 -0.135653 -0.104063 -0.042752 -0.393589 -0.360568 -0.205933 -0.390106 -0.678072 0.229013 0.272355 0.217549 0.189868 0.235777 0.268078 0.188640 0.250764 0.223587 0.217236 0.269561 0.188130 0.216883 0.219579 0.387302 0.398359 0.358079 0.359304 0.341618 0.222314 0.190663 0.329629 0.355818 0.218352 0.205841 0.211815 0.227295 0.212817
chargesum: 0.00000
title: Mulliken charges with hydrogens summed into heavy atoms:
elementType: O O O O O O O O O O O C C C C C C C C C C C C C C C
charge: -0.275045 -0.227032 -0.289759 -0.129996 -0.273873 -0.091151 -0.103170 -0.071003 -0.080209 -0.085547 -0.083638 0.145651 0.184891 0.177981 0.167456 0.078478 0.069945 0.121920 0.115111 0.119524 0.174484 0.064103 0.075894 0.207044 0.034087 -0.026145
polarizability: 2.49804981e+02 1.94003139e-01 1.99034728e+02 -3.21086601e-01 -3.33563994e+00 1.56504518e+02
1716.lowfreq: -4.0541 -0.0008 -0.0005 0.0004 4.3940 8.3513 15.3764 23.2669 30.6750
frequency: 14.8620 23.1832 30.6498 42.3991 45.2762 55.7409 73.2287 87.4206 91.9111 97.4030 104.6641 110.1655 116.3015 133.9357 148.2373 168.3578 187.0727 198.3610 212.4080 219.2313 232.1147 239.6302 250.6274 257.8305 265.5623 274.8005 288.7663 303.8968 310.6280 325.4933 338.4993 350.6965 372.0303 375.8189 394.2379 406.3751 420.5367 429.0074 439.4915 444.6598 453.1948 459.5881 506.1248 522.8671 531.4932 593.1117 618.2517 657.7432 669.3430 703.7328 729.4430 754.6263 760.5807 764.0120 777.2990 810.2839 843.3320 856.3377 883.3665 892.0837 899.8207 927.5531 938.3469 943.3710 952.0592 967.2733 968.8154 990.1624 1002.0530 1006.4100 1012.6607 1022.9389 1027.8417 1039.1096 1050.5777 1052.7664 1055.6266 1061.2997 1079.2491 1086.9714 1096.4827 1100.0896 1103.7120 1121.8004 1135.4057 1144.8121 1179.4458 1187.1213 1190.6469 1202.9579 1221.1777 1227.2324 1229.6306 1232.4223 1250.5110 1258.1734 1269.9848 1278.8388 1281.5802 1288.9514 1298.1233 1300.9926 1306.5512 1309.0654 1319.1177 1320.8763 1325.3158 1327.1589 1343.5527 1344.3809 1347.5181 1358.9257 1373.3131 1378.2527 1380.7994 1383.2643 1385.0423 1389.5116 1396.2575 1398.3732 1409.0122 1436.9864 1442.5503 1463.3613 1474.2699 1479.8866 1483.5320 1493.8763 2914.4188 2920.8703 2947.8033 2951.5819 2954.3159 2970.6443 2975.4955 2980.1322 2982.9748 2989.3746 2997.7109 2998.7128 3005.8043 3014.0585 3020.2477 3050.8322 3064.5603 3079.6907 3084.8332 3086.6956 3118.4651 3175.5311 3506.4426 3522.4701 3529.7554 3545.3442 3554.7928 3594.6117
redmass: 5.7842 4.2314 4.6723 1.8880 3.5893 6.3661 5.6649 4.2890 4.1170 5.0018 4.6844 5.4551 3.2611 3.6305 3.9556 4.1307 3.5563 4.5391 2.4706 1.1242 5.3752 4.0379 2.3608 1.9773 3.9130 3.4326 1.8803 4.3232 4.9252 5.3425 4.7882 3.7131 4.7522 2.5200 3.3454 4.6926 1.2864 1.7902 4.0270 3.4572 1.3085 3.9549 1.3072 3.5079 3.6115 3.9509 4.7923 4.5863 4.2769 5.1512 4.0537 3.4969 1.1131 1.3905 2.8360 3.6346 3.7725 3.4520 1.2889 2.4712 1.7959 4.8411 2.4451 2.6393 5.6244 3.9483 3.7984 4.5979 3.9701 5.9512 4.7790 4.7886 4.1509 3.8588 2.6062 3.0273 2.4833 2.5806 2.5374 2.3344 3.0851 3.2830 2.5807 2.3103 2.1453 1.4657 1.3241 1.1921 1.3704 1.4976 1.3026 1.2629 1.2586 1.2165 1.2993 1.3484 1.1586 1.1217 1.3780 1.1648 1.1891 1.2326 1.3806 1.2509 1.3306 1.3590 1.3358 1.3017 1.2647 1.2817 1.2827 1.2224 1.2070 1.3203 1.3423 1.4441 1.3759 1.3425 1.3857 1.3317 1.5695 1.3334 1.0819 1.0855 1.0585 1.0416 1.0751 1.0850 1.0822 1.0822 1.0593 1.0768 1.0760 1.0833 1.0840 1.0362 1.0840 1.0857 1.0644 1.0601 1.0840 1.1020 1.0860 1.1023 1.0869 1.1023 1.0991 1.1000 1.0930 1.0705 1.0653 1.0647 1.0652 1.0654 1.0664 1.0668
irintensity: 0.2828 0.0559 0.7644 0.3983 0.3666 0.3183 2.3255 4.2059 1.9541 2.3282 1.9873 3.7115 3.3975 4.4435 5.8118 13.4915 3.9746 7.8485 48.1603 0.3636 0.9986 11.4600 71.0982 62.9013 26.0464 44.3768 59.6849 12.5881 2.1721 5.3473 7.2260 15.3450 7.9555 11.3499 0.9719 15.6774 230.2442 25.5611 12.4659 50.1500 112.9585 28.4088 86.3379 11.1140 16.9146 1.8152 15.1992 37.1035 83.4189 7.1162 27.4785 42.5740 6.0006 143.4546 14.4521 10.7700 31.7980 22.2593 7.9332 28.0112 11.5748 254.7122 129.4295 6.7250 146.9732 10.4304 196.3234 158.2480 84.9954 37.6872 36.5363 76.7906 47.3492 99.6197 58.1589 50.2731 28.8334 29.4899 69.5897 8.0384 11.4107 171.9495 43.1543 34.5842 2.6296 0.9851 43.2375 39.5255 19.4910 7.1254 17.8038 0.8667 48.0220 28.5706 21.1488 8.8675 6.3081 2.8300 12.9176 6.5146 4.2485 2.7477 24.1724 2.1961 14.0781 5.0494 8.9992 47.7259 34.5947 8.0385 16.6858 27.8783 25.6958 45.3339 8.6447 12.7222 5.5483 10.7373 3.8887 11.5359 6.2501 44.7972 12.5933 5.7059 2.6365 13.5709 2.9334 14.1268 8.7687 51.4591 42.6788 54.0083 37.3968 6.2853 65.4836 37.7086 42.9615 45.4011 48.1143 30.2122 4.1327 12.7768 46.1831 3.8524 19.2653 79.3106 40.0727 30.2214 5.6438 775.0733 4.9897 49.4355 16.4787 9.7938 7.4018 16.5242
temp: 298.150 k
press: 1.00000 atm
elementType: 8 8 8 8 8 8 8 8 8 8 8 6 6 6 6 6 6 6 6 6 6 6 6 6 6 6 1 1 1 1 1 1 1 1 1 1 1 1 1 1 1 1 1 1 1 1 1 1 1 1 1 1 1 1
symmnumber: 1
zpe: 1154170.6 jmol-1
zpe.correction: 0.439600 hartree
zpe.thermalcorrener: 0.468557 hartree
zpe.thermalcorrenthalpy: 0.469501 hartree
zpe.thermalcorrgfe: 0.378668 hartree
zpe.sumelectzpe: -1413.648434 hartree
zpe.sumelectthermal: -1413.619478 hartree
zpe.sumelectthermalent: -1413.618533 hartree
zpe.sumelectthermalfe: -1413.709367 hartree
dipole: 7.9951 -1.9087 -1.9497
dipole: 8.4479
quadrupole: -162.9077 -171.5534 -150.4491
quadrupole: -4.7569 11.5841 -12.1237
quadrupole: -1.2709 -9.9166 11.1876 -4.7569 11.5841 -12.1237
hfenergy: -1414.0880343 hartree
pointgroup: C01 [X(C15H28O11)]
dipole: 3.1857875 -0.6914256 -0.6475647 debye
polarizability: 249.6728586|1.3700097|199.0137218|3.1006227|-3.602257|156.6576467 unknown
InChI: InChI=1S/C15H28O11/c1-2-3-23-14-12(22)10(20)13(7(5-17)25-14)26-15-11(21)9(19)8(18)6(4-16)24-15/h6-22H,2-5H2,1H3
charge 0 multiplicity 1
54 atoms
O  -0.562189 -0.218673 0.135155
O  2.080362 0.812031 1.105556
O  -2.491055 1.088839 0.037013
O  0.563443 -2.56606 -0.967914
O  4.001268 -0.425133 0.302973
O  -2.172709 -2.53891 -0.900268
O  2.601869 -2.931007 0.814508
O  -4.916777 -2.38802 -0.069782
O  -4.716248 0.099424 1.562171
O  1.649605 3.552761 -0.081767
O  -3.463858 3.670668 -0.549953
C  0.633717 -0.115509 -0.715593
C  1.423291 -1.431592 -0.603772
C  1.529902 1.059112 -0.247286
C  -1.852276 -0.129859 -0.497822
C  -2.657147 -1.396084 -0.137821
C  1.948694 -1.616418 0.827448
C  -4.143776 -1.235149 -0.505702
C  -4.726084 0.062611 0.097188
C  -3.89532 1.240741 -0.4701
C  2.867505 -0.428667 1.193486
C  0.765225 2.388411 -0.171799
C  -4.340123 2.630096 -0.005938
C  5.067188 0.521266 0.717338
C  6.171656 0.473099 -0.34051
C  7.356411 1.391433 0.033653
H  0.332476 0.048072 -1.771454
H  2.291284 -1.394066 -1.29187
H  2.375772 1.137123 -0.966493
H  -1.756363 -0.046023 -1.606452
H  -2.554227 -1.569008 0.955175
H  1.095279 -1.603781 1.534489
H  -4.195669 -1.142199 -1.616934
H  -5.790668 0.151297 -0.179868
H  -3.875731 1.211666 -1.580718
H  3.183195 -0.451176 2.256752
H  0.163135 2.404657 0.748088
H  0.082403 2.469616 -1.045684
H  -5.345264 2.851421 -0.401734
H  -4.377606 2.660779 1.100857
H  1.049669 -3.38466 -0.682713
H  -1.164395 -2.597656 -0.841989
H  2.839081 -3.20833 1.73325
H  -4.413142 -3.192334 -0.364055
H  -3.774747 0.238805 1.850002
H  4.63821 1.538871 0.813617
H  5.455663 0.208321 1.710772
H  2.147925 3.65244 -0.932463
H  -2.540586 3.458383 -0.254401
H  6.516519 -0.572033 -0.450078
H  5.748634 0.774896 -1.317527
H  7.815295 1.0840 0.991854
H  8.141584 1.35388 -0.741788
H  7.034401 2.444625 0.136602
