program: Gaussian 09
title: 000146707
version: EM64L-G09RevD.01
frameworkgroup: C1[X(C7H8N2O3)]
method: RPBEPBE
basis: SDD
operation: Freq
keyword: #pfreq=noraman
keyword: PBEPBE/SDD
title: #p freq=noraman PBEPBE/SDD
converged: NO YES NO YES
title: Mulliken charges:
elementType: O O O N N C C C C C C C H H H H H H H H
charge: -0.302964 -0.219898 -0.209719 -0.017562 0.026539 0.388016 0.228918 0.345912 -0.412571 -0.398193 -0.764905 -0.745356 0.295986 0.299758 0.214362 0.260362 0.260356 0.261703 0.261689 0.227566
chargesum: 0.00000
title: Mulliken charges with hydrogens summed into heavy atoms:
elementType: O O O N N C C C C C C C
charge: -0.302964 -0.219898 -0.209719 -0.017562 0.026539 0.388016 0.228918 0.345912 -0.116585 -0.098435 -0.029825 0.005601
polarizability: 1.75817841e+02 5.25070872e+00 1.20981503e+02 5.42612116e-03 6.31114398e-03 4.90795767e+01
1716.lowfreq: -0.0005 -0.0002 0.0003 8.3888 9.1695 10.1401 40.4505 87.8187 146.7506
frequency: 40.4490 87.8182 146.7500 162.2890 216.5535 222.2907 250.5758 308.8660 331.6283 341.9239 351.5291 425.8488 450.5171 473.5293 583.2119 596.3707 632.5884 680.6809 718.6890 722.5023 747.9196 818.4573 862.3478 925.6503 992.6786 1027.5239 1040.8105 1045.8380 1049.5358 1161.9130 1193.4871 1206.3571 1250.1959 1276.0962 1296.4508 1337.9306 1374.6539 1408.3061 1410.5570 1442.1324 1452.5021 1456.7754 1466.1139 1511.3085 1526.7300 1634.1200 2994.9459 3002.7359 3069.9739 3091.3235 3105.3032 3122.0375 3190.3473 3204.2725
redmass: 9.2772 5.0449 2.0448 1.3645 6.0465 1.2787 2.3873 3.2176 4.0714 4.8616 8.2283 8.6461 3.0243 5.4261 5.0838 4.6808 6.1985 5.1408 6.2711 5.1311 8.5393 3.9945 1.4181 1.3331 1.7421 1.3751 1.5180 3.4338 1.5112 3.3908 3.0154 9.3938 2.1754 2.7757 5.5289 6.3345 3.2801 1.2006 1.2653 1.0438 1.0447 1.1422 1.2276 3.1509 7.0908 6.6124 1.0376 1.0363 1.0961 1.0965 1.1016 1.1002 1.0920 1.0937
irintensity: 0.0128 9.7733 0.2791 0.6509 4.6158 0.2101 0.7684 5.6572 3.1614 0.0214 1.1156 6.6229 5.4845 0.1462 6.3650 2.8009 23.6486 1.5491 0.1482 3.2611 3.9452 3.3876 18.8562 18.2247 3.4249 7.5630 5.5608 22.5955 14.0707 33.7337 83.6580 362.0071 56.2869 30.8954 19.3500 95.1252 35.3291 32.9434 27.1821 15.4745 14.4836 1.2483 34.5302 61.0495 17.0112 36.6650 6.0446 9.2029 6.5468 4.7460 20.5819 8.6159 5.4421 0.3978
temp: 298.150 k
press: 1.00000 atm
elementType: 8 8 8 7 7 6 6 6 6 6 6 6 1 1 1 1 1 1 1 1
symmnumber: 1
zpe: 385448.4 jmol-1
zpe.correction: 0.146810 hartree
zpe.thermalcorrener: 0.157794 hartree
zpe.thermalcorrenthalpy: 0.158738 hartree
zpe.thermalcorrgfe: 0.109798 hartree
zpe.sumelectzpe: -605.708576 hartree
zpe.sumelectthermal: -605.697592 hartree
zpe.sumelectthermalent: -605.696648 hartree
zpe.sumelectthermalfe: -605.745587 hartree
dipole: 1.9537 0.9405 0.0003
dipole: 2.1682
quadrupole: -89.7725 -64.7118 -68.8621
quadrupole: -13.6787 -0.0023 -0.0006
quadrupole: -15.3237 9.7370 5.5867 -13.6787 -0.0023 -0.0006
hfenergy: -605.8553855 hartree
pointgroup: C01 [X(C7H8N2O3)]
dipole: 0.7854664 -0.3327834 -0.0001018 debye
dipolederiv: -1.0687492 0.1593334 0.0000468 0.2123975 -0.3916436 -0.0000147 0.000051 -0.0000198 -0.2892721 -0.5796702 0.1649704 0.0000253 0.408733 -0.8902228 -0.0000414 0.0001045 -0.0001534 -0.2404555 -0.9571181 -0.1306276 -0.0000254 -0.2990073 -0.5366084 -0.0000607 0.0000712 0.0000065 -0.220403 0.9147864 -0.194654 -0.0000892 -0.3572402 0.2309918 0.0000109 -0.0000956 0.0000212 0.1410956 1.978413 -0.2796391 -0.0000589 -0.3626162 1.2275595 0.0001234 -0.0001614 0.0001392 0.1807483 0.4518166 0.2074195 0.0000009 -0.1309643 0.2811092 0.000032 -0.0000634 0.0000206 0.054917 -0.9449931 0.2657674 0.0000696 0.2031532 -0.1616995 -0.0000269 0.0000365 -0.0000055 0.0096925 0.0596114 0.4551294 0.0000341 0.6509782 0.0715591 -0.0000073 -0.0000315 -0.0000916 -0.0285962 0.3030785 -0.2697824 -0.0000309 0.0901994 -0.1037784 -0.0000216 -0.0000062 0.0000175 -0.0594509 -0.444958 -0.1418072 0.0000168 -0.2854301 0.0478973 0.0000145 -0.0000237 0.000021 -0.1525155 -0.0689939 -0.2700345 -0.0000101 -0.1199593 0.0008933 -0.0000065 -0.0000019 -0.0000044 0.0114724 -0.1650546 -0.2224272 -0.0000315 -0.0804501 0.0347713 0.0000286 0.0001058 0.0002067 0.0382817 0.1429151 0.0250207 -0.0000036 -0.0218654 0.0557278 -0.0000106 -0.000004 -0.0000219 0.1585485 0.0637834 0.0085933 0.0000031 -0.0098369 0.0351864 -0.0000096 0.0000229 -0.0000056 0.1748674 0.0301288 0.1682105 0.0000024 0.0337972 -0.0923619 -0.0000029 0.0000009 -0.0000067 0.1103067 0.0545949 -0.0094055 0.0798938 0.0131911 0.0689101 -0.0311324 0.0665104 -0.0036033 0.0019498 0.054593 -0.0094033 -0.0798941 0.013186 0.0689017 0.0311337 -0.0665139 0.0036002 0.0019329 0.0516878 -0.0224805 -0.0743366 0.0192207 0.0613564 0.047056 -0.0766979 -0.0005664 -0.0062811 0.05171 -0.0225857 0.074288 0.0189585 0.0613816 -0.046924 0.0766822 0.00061 -0.0065365 0.0724182 0.1184023 0.0000996 0.0035552 -0.0699309 -0.0001405 0.0000141 -0.0001642 0.119698 unknown
polarizability: 176.1943558|-2.6041234|120.6049882|-0.0057221|0.0060441|49.0795767 unknown
InChI: InChI=1S/C7H8N2O3/c1-5-4-8(10)6(2)3-7(5)9(11)12/h3-4H,1-2H3
charge 0 multiplicity 1
20 atoms
O  3.1793 -0.832961 -0.000266
O  -2.421422 1.954258 0.000255
O  -3.167595 -0.200946 0.000025
N  1.897061 -0.484372 -0.000152
N  -2.211948 0.674275 -0.000032
C  -0.464849 -1.179162 -0.000135
C  -0.818647 0.206664 -0.000038
C  1.543273 0.880597 0.000009
C  0.187025 1.204713 0.000051
C  0.907931 -1.465086 -0.000182
C  -1.428809 -2.346803 -0.000192
C  2.679793 1.857968 0.00008
H  -0.117266 2.253334 0.000155
H  1.300322 -2.482743 -0.000268
H  -0.873739 -3.299884 -0.000204
H  -2.094406 -2.316434 0.878813
H  -2.094352 -2.316392 -0.87924
H  3.327872 1.702483 0.881642
H  3.327033 1.703644 -0.882315
H  2.300126 2.891247 0.000893
