program: Gaussian 09
title: 000146695
version: EM64L-G09RevD.01
frameworkgroup: C1[X(C8H8N4O4)]
method: RPBEPBE
basis: SDD
operation: Freq
keyword: #pfreq=noraman
keyword: PBEPBE/SDD
title: #p freq=noraman PBEPBE/SDD
converged: NO YES NO NO
title: Mulliken charges:
elementType: O O O O N N N N C C C C C C C C H H H H H H H H
charge: -0.255406 -0.199247 -0.204622 -0.225129 -0.481507 -0.168039 0.019623 0.040319 0.530505 -0.578805 0.426723 -0.352959 -0.386053 -0.167600 0.327777 -0.620999 0.290391 0.309904 0.360397 0.290016 0.242787 0.261900 0.278137 0.261888
chargesum: 0.00000
title: Mulliken charges with hydrogens summed into heavy atoms:
elementType: O O O O N N N N C C C C C C C C
charge: -0.255406 -0.199247 -0.204622 -0.225129 -0.121110 -0.168039 0.019623 0.040319 0.530505 -0.288414 0.426723 -0.043056 -0.096037 0.075186 0.327777 0.180927
polarizability: 2.20649355e+02 -7.42026488e+00 1.56856920e+02 2.03814898e-02 -5.89965746e-03 5.48872403e+01
1716.lowfreq: -4.5890 -0.0006 0.0003 0.0006 3.0315 6.1371 35.0153 47.0864 73.0379
frequency: 34.6739 47.0853 73.0200 81.2138 104.0868 127.6333 170.4542 183.7366 193.6926 223.6831 271.6799 310.2338 316.6888 367.2771 390.6740 400.8690 429.4416 483.2460 522.5012 538.7697 602.1959 657.8166 685.6217 695.2142 704.7754 752.4507 774.3767 801.8170 822.6632 845.2302 891.8293 923.5644 929.8906 951.8213 985.5644 1008.0750 1087.0711 1092.3297 1096.9651 1115.9842 1180.1117 1184.4675 1216.2735 1250.9536 1283.6187 1308.5520 1375.3488 1377.3266 1390.7699 1417.2488 1439.6107 1461.1212 1471.0443 1484.9648 1532.3944 1594.1559 1623.3809 1656.9853 3008.7635 3094.2207 3153.5214 3157.0953 3162.0128 3191.5864 3197.7538 3423.1442
redmass: 6.5932 8.3613 5.4618 9.3131 5.7233 1.0808 5.6772 9.7889 5.8048 7.2379 4.9757 6.8893 3.8179 6.7110 6.2286 8.9760 3.3456 11.8855 7.0025 5.0296 6.9822 8.3663 2.6007 6.0136 4.9205 7.7697 6.5491 1.2232 1.3891 6.3845 4.4103 1.5932 3.6421 1.3655 6.2177 1.3386 1.9237 1.6467 3.4060 1.3283 1.1839 2.4164 6.6431 2.0218 4.3362 1.5813 7.7213 9.5666 5.6208 1.2609 3.5054 1.0424 1.0809 2.7414 2.2032 5.0914 6.5977 8.3502 1.0339 1.1011 1.1009 1.0897 1.0924 1.0932 1.0973 1.0767
irintensity: 0.1397 0.0415 0.8307 0.2488 12.6678 0.7120 0.0119 11.5150 0.7507 10.1303 0.5851 5.3816 6.1919 16.0832 1.9930 4.4255 0.9037 0.9022 1.4011 9.5027 28.6045 16.6187 20.9759 0.0014 17.4989 27.3096 40.2829 94.3671 24.9981 81.2837 19.5108 59.1101 247.8112 0.8356 0.3620 3.7084 19.7339 15.1749 113.7711 0.5008 9.8590 22.9983 252.3085 58.4878 18.0757 35.1455 264.3682 51.6515 31.3611 56.7574 42.6117 23.4744 23.2905 52.9726 694.4823 72.6145 52.7321 200.8188 11.6724 10.5910 0.3805 9.1261 7.0820 7.9358 1.5171 82.8239
temp: 298.150 k
press: 1.00000 atm
elementType: 8 8 8 8 7 7 7 7 6 6 6 6 6 6 6 6 1 1 1 1 1 1 1 1
symmnumber: 1
zpe: 438624.8 jmol-1
zpe.correction: 0.167063 hartree
zpe.thermalcorrener: 0.181578 hartree
zpe.thermalcorrenthalpy: 0.182522 hartree
zpe.thermalcorrgfe: 0.124073 hartree
zpe.sumelectzpe: -828.264722 hartree
zpe.sumelectthermal: -828.250208 hartree
zpe.sumelectthermalent: -828.249264 hartree
zpe.sumelectthermalfe: -828.307713 hartree
dipole: 3.5507 3.4758 -0.0006
dipole: 4.9688
quadrupole: -104.5271 -100.6389 -91.3500
quadrupole: -6.5542 -0.0028 0.0013
quadrupole: -5.6885 -1.8002 7.4887 -6.5542 -0.0028 0.0013
hfenergy: -828.4317856 hartree
pointgroup: C01 [X(C8H8N4O4)]
dipole: -1.3746594 1.389887 0.0002517 debye
dipolederiv: -0.8027351 -0.0581847 -0.0000759 0.3740047 -0.9323937 -0.0000186 -0.0001441 0.0000396 -0.3473201 -0.9473684 -0.0107647 -0.0000502 0.0644107 -0.4694991 0. 0.0000418 0.0000203 -0.2219972 -0.536749 0.0220915 0.0000071 0.0828516 -0.8371316 0.0000669 -0.0000121 -0.0000303 -0.2263826 -0.7987638 -0.7919282 -0.00025 -0.3126846 -0.7152488 -0.0000792 -0.0003696 -0.0004916 -0.1737553 -2.1626267 -0.0856001 -0.000269 0.2102971 -0.3461101 0.0000391 -0.0002318 -0.0000071 -0.299768 -0.7490091 -0.2456702 -0.0001816 -1.0132339 -1.1646246 -0.0003277 -0.0000865 -0.0000218 -0.1207509 1.5379735 -0.2650096 0.0000423 -0.4522202 1.3296425 -0.0000787 0.0000322 -0.0000404 0.1862892 0.1118231 0.5157065 0.0002233 0.8013538 1.3569925 0.0003538 0.0002985 0.0004399 -0.0468131 1.4471608 0.2535674 0.0001411 0.5929048 -0.083145 0.000068 0.0001154 0.0000265 0.1167736 -0.2229752 -0.2818994 -0.0000149 0.1412233 -0.0424994 -0.0000005 -0.0000296 -0.0000088 -0.1623416 -0.2259773 0.3548833 -0.0000051 0.3521053 -0.1716105 0.0000224 -0.0000398 0.0000401 0.0795399 -0.1881983 -0.0157784 -0.0000167 -0.2515775 -0.0310526 -0.000027 0.0000105 -0.0000009 -0.139898 -0.1499844 0.0458573 -0.0000052 -0.2423745 -0.0507971 -0.0000168 -0.0000055 0.0000091 -0.1335932 -0.1080663 0.0464694 0.0000017 0.1299852 0.2273614 0.0000069 0.000004 -0.0000068 -0.1207458 2.5876117 0.4637124 0.0004037 -0.3451493 1.3292485 0.0000016 0.0004849 0.0000753 0.3105201 0.224562 0.0230294 0.0000047 -0.141083 0.0246774 -0.0000196 -0.0000807 -0.000051 0.1999694 0.1270497 -0.0390881 -0.0000025 -0.0853316 0.053294 -0.0000052 0.0000019 -0.0000037 0.1835014 0.1561177 0.0664954 0.0000051 0.0500106 0.10768 0.0000068 -0.0000024 0.0000092 0.1769527 0.3505826 0.0723933 0.0000257 0.1454186 0.2046565 0.0000216 0.0000124 -0.000003 0.3015068 0.0500392 -0.0387627 -0.0000113 -0.0078409 0.1308449 -0.0000007 -0.0000144 0.0000023 0.1806198 0.0652598 -0.0293213 -0.0000056 -0.0399736 -0.0746389 -0.0000028 -0.0000031 -0.0000018 0.1522813 0.0175545 0.0192623 -0.0408047 -0.0416694 0.0697698 -0.0796321 -0.071292 -0.0272997 -0.0198095 0.1992042 -0.0407047 -0.0000047 0.0303265 0.0148594 -0.0000167 0.0000087 -0.000033 0.14496 0.0175147 0.0192441 0.0408427 -0.0417536 0.0697246 0.0796386 0.0713013 0.0273377 -0.019739 unknown
polarizability: 220.8724418|6.3858685|156.6338329|0.0204741|0.0055696|54.8872403 unknown
InChI: InChI=1S/C8H8N4O4/c1-11(10-14)8(13)9-6-3-2-4-7(5-6)12(15)16/h2-5,9H,1H3
charge 0 multiplicity 1
24 atoms
O  -2.347772 1.957762 -0.000333
O  4.916421 -0.723004 0.000213
O  3.340148 -2.370478 0.000246
O  -4.33774 -2.185347 -0.001189
N  -1.086554 -0.046034 -0.000044
N  -3.444786 -0.124553 -0.000429
N  3.692346 -1.128337 0.000327
N  -3.256246 -1.509635 -0.000466
C  0.247905 0.435415 0.000058
C  1.280308 -0.534961 0.000148
C  2.618236 -0.099245 0.000244
C  0.577713 1.820052 0.000061
C  2.975823 1.265691 0.000231
C  1.932673 2.214207 0.000151
C  -2.247159 0.702959 -0.000182
C  -4.786779 0.480783 -0.000708
H  1.071472 -1.609476 0.000152
H  -0.222502 2.562361 -0.000007
H  -1.236797 -1.064586 -0.000017
H  4.029892 1.55199 0.000302
H  2.173991 3.281804 0.000158
H  -5.345362 0.154651 -0.894698
H  -4.660638 1.57186 -0.000547
H  -5.345795 0.15442 0.892928
