program: Gaussian 09
title: 000146709
version: EM64L-G09RevD.01
frameworkgroup: C1[X(C13H9N3O2)]
method: RPBEPBE
basis: SDD
operation: Freq
keyword: #p
keyword: freq=noraman
keyword: PBEPBE/SDD
title: #p freq=noraman PBEPBE/SDD
converged: YES YES NO NO
title: Mulliken charges:
elementType: O O N N N C C C C C C C C C C C C C H H H H H H H H H
charge: -0.255423 -0.183598 -0.057544 -0.664197 -0.003953 0.190167 0.282478 0.273829 -0.089533 -0.091196 0.269702 -0.318462 -0.343187 -0.370835 -0.309959 -0.227843 -0.281316 -0.229283 0.279620 0.194700 0.277143 0.268742 0.246581 0.232642 0.314974 0.359234 0.236517
chargesum: 0.00000
title: Mulliken charges with hydrogens summed into heavy atoms:
elementType: O O N N N C C C C C C C C C C C C C
charge: -0.255423 -0.183598 -0.057544 0.010011 -0.003953 0.190167 0.282478 0.273829 -0.089533 -0.091196 0.269702 -0.038842 -0.148487 -0.093692 -0.041217 0.018739 -0.048674 0.007234
polarizability: 3.20071126e+02 3.61886832e+00 2.09535883e+02 -5.48398860e+00 8.66309303e-01 7.14854210e+01
1716.lowfreq: -0.0006 -0.0003 0.0004 2.8531 3.8280 7.3173 41.1592 65.8009 86.0844
frequency: 41.1425 65.7774 86.0842 119.9545 175.7012 220.4412 238.6119 265.3501 311.6465 339.8996 361.1922 386.8711 410.1826 431.0814 464.8275 495.1647 513.0636 529.9501 552.9923 567.7612 596.8137 621.6397 638.6234 644.2332 680.1432 694.1663 724.3845 733.3386 760.2715 771.9999 788.2048 826.9958 835.3347 867.1000 885.9492 934.6142 946.2445 953.4793 995.1449 996.1049 1025.8278 1073.2280 1111.5690 1120.8899 1141.0486 1158.4492 1168.7831 1190.6315 1202.6092 1250.5753 1279.5639 1309.8082 1332.1295 1350.0302 1373.5005 1409.4513 1422.4930 1446.0155 1456.8053 1494.1061 1524.9225 1532.0993 1554.5587 1596.4869 1623.6765 1652.9788 3117.9523 3139.8498 3155.2220 3157.7751 3173.5097 3175.2572 3187.0087 3360.3467 3636.2731
redmass: 6.7621 4.7507 9.4458 4.4239 5.1615 6.9362 5.1227 6.6165 5.5219 8.6808 5.9007 4.3973 4.8134 2.2771 3.8673 3.1400 2.1125 6.7023 3.1581 4.7507 5.8829 6.7273 3.3172 6.3226 5.0353 6.4984 1.7817 2.0067 1.4507 7.4769 2.3584 2.2025 3.7259 1.7822 4.8630 1.4916 6.2258 1.3726 1.3422 1.3547 2.2426 2.4276 2.7535 3.0320 1.6743 1.4681 1.1942 2.9768 1.9739 2.0218 1.9016 4.9917 5.0679 3.2321 2.7605 4.9816 3.4114 2.5705 3.5417 4.2428 6.8034 6.1053 6.6196 6.1275 6.3420 1.2281 1.0864 1.0885 1.0873 1.0944 1.0997 1.0934 1.0985 1.0617 1.0881
irintensity: 1.4282 2.1370 0.3959 5.5634 1.1653 3.3685 0.2731 0.7413 0.4855 1.0234 9.2736 3.4046 5.1990 3.3317 9.4837 9.2021 19.3590 1.9806 10.2465 7.3133 3.8135 8.7601 12.3799 2.6578 8.2754 5.7134 131.3509 52.9861 93.3209 3.8655 21.4283 26.9446 16.0907 5.4140 0.6585 1.7240 2.8107 1.7971 0.0701 1.4732 9.3551 15.8569 1.5325 29.1202 0.7692 3.1282 2.4872 275.4410 172.7064 5.8768 0.8488 10.0604 84.8878 88.6646 40.6689 16.7354 8.3673 0.8003 27.2266 107.5447 57.4842 31.0728 9.2961 6.4764 10.0009 229.6753 6.6194 11.2010 4.8600 20.7115 27.2897 5.6895 4.1164 79.2333 42.9647
temp: 298.150 k
press: 1.00000 atm
elementType: 8 8 7 7 7 6 6 6 6 6 6 6 6 6 6 6 6 6 1 1 1 1 1 1 1 1 1
symmnumber: 1
zpe: 516654.7 jmol-1
zpe.correction: 0.196783 hartree
zpe.thermalcorrener: 0.210194 hartree
zpe.thermalcorrenthalpy: 0.211138 hartree
zpe.thermalcorrgfe: 0.156478 hartree
zpe.sumelectzpe: -814.189499 hartree
zpe.sumelectthermal: -814.176088 hartree
zpe.sumelectthermalent: -814.175144 hartree
zpe.sumelectthermalfe: -814.229804 hartree
dipole: -2.8043 0.1057 -0.2306
dipole: 2.8158
quadrupole: -98.5324 -93.2436 -109.7886
quadrupole: 18.3634 1.2576 1.8659
quadrupole: 1.9891 7.2779 -9.2671 18.3634 1.2576 1.8659
hfenergy: -814.3862821 hartree
pointgroup: C01 [X(C13H9N3O2)]
dipole: -1.1031246 0.0564158 -0.0846263 debye
polarizability: 320.0613238|1.4868524|209.2886748|-7.4571037|-4.7541563|71.7424314 unknown
InChI: InChI=1S/C13H9N3O2/c14-13-8-4-1-2-5-9(8)15-10-6-3-7-11(12(10)13)16(17)18/h1-7H,14H2
charge 0 multiplicity 1
27 atoms
O  2.586403 -2.197538 0.947673
O  4.07907 -1.410275 -0.581569
N  -1.068632 1.797632 0.024421
N  0.135718 -2.306746 -0.085471
N  2.991946 -1.28509 0.101734
C  0.777788 0.086565 0.047326
C  -0.205752 -0.979358 0.010659
C  -1.612752 -0.621638 0.02121
C  0.257019 1.460283 0.033578
C  -1.985168 0.778541 0.023117
C  2.225428 -0.022439 -0.01327
C  1.158361 2.58214 -0.014543
C  -2.662584 -1.600109 0.042315
C  3.069188 1.094129 -0.113794
C  -3.377068 1.140056 0.018508
C  2.534652 2.410923 -0.09951
C  -4.006123 -1.222618 0.043731
C  -4.368806 0.163808 0.024942
H  0.69147 3.571081 -0.001157
H  -2.436759 -2.672334 0.079565
H  4.147931 0.928824 -0.174081
H  -3.610396 2.208912 0.010933
H  3.209157 3.270767 -0.147021
H  -4.788233 -1.988764 0.067686
H  -0.596926 -3.004185 -0.188878
H  1.059208 -2.621389 0.237798
H  -5.42644 0.44842 0.022598
