program: Gaussian 09
title: 000146706
version: EM64L-G09RevD.01
frameworkgroup: C1[X(C18H14ClO2P)]
method: RPBEPBE
basis: SDD
operation: Freq
keyword: #p
keyword: freq=noraman
keyword: PBEPBE/SDD
title: #p freq=noraman PBEPBE/SDD
converged: YES YES NO NO
title: Mulliken charges:
elementType: Cl P O O C C C C C C C C C C C C C C C C C C H H H H H H H H H H H H H H
charge: -0.066242 1.070268 -0.541758 -0.622508 -0.105342 -0.113846 -0.297984 -0.237958 -0.241944 -0.295518 0.390818 -0.206684 -0.220865 -0.224142 -0.205255 -0.220223 -0.221451 -0.326883 -0.369082 -0.183804 -0.183878 -0.115323 0.279467 0.238596 0.254858 0.287222 0.237382 0.235927 0.235600 0.237284 0.235456 0.235771 0.302233 0.248807 0.255939 0.255061
chargesum: 0.00000
title: Mulliken charges with hydrogens summed into heavy atoms:
elementType: Cl P O O C C C C C C C C C C C C C C C C C C
charge: -0.066242 1.070268 -0.541758 -0.622508 -0.105342 -0.113846 -0.018516 0.000638 0.012915 -0.008296 0.390818 0.030698 0.015061 0.011458 0.032029 0.015232 0.014320 -0.024650 -0.120275 0.072135 0.071183 -0.115323
polarizability: 2.82889705e+02 -2.73814348e+01 1.88906800e+02 3.07280063e+00 1.50821299e+01 2.09254908e+02
1716.lowfreq: -9.6230 -8.8878 -1.9222 -1.4116 -0.0014 -0.0010 -0.0007 16.3034 28.2361
frequency: -6.7871 16.2397 28.1913 33.8026 42.8434 55.4619 85.8294 118.4782 144.8459 162.2431 203.6730 211.2430 224.1044 242.1582 276.7904 292.4859 337.2200 368.5574 390.2615 394.7501 398.1676 414.2337 439.9905 447.2370 494.2005 510.1074 525.9326 568.5744 610.4054 611.8377 624.2629 664.7024 685.6455 696.9293 698.6787 703.8710 706.7505 760.3586 767.2535 814.6105 823.7083 835.4574 856.0088 863.7410 932.2401 939.5060 942.0949 963.9883 984.6241 985.9100 986.4200 987.4660 992.5342 999.2480 1005.9464 1007.6713 1020.6361 1023.1661 1068.5333 1076.7033 1082.9467 1089.0984 1097.8509 1104.6665 1172.7736 1175.2430 1176.1092 1186.2809 1189.8437 1198.2925 1289.1860 1308.1911 1314.5035 1364.0737 1379.8961 1382.6096 1399.9814 1426.2836 1429.5642 1464.3393 1466.9074 1467.9055 1584.7508 1587.0419 1590.3181 1594.9114 1595.8391 1597.4396 3130.6863 3131.8473 3137.3840 3140.6760 3145.9459 3149.6699 3150.6529 3156.6685 3157.4665 3162.2935 3169.6094 3172.3416 3172.3705 3178.4244
redmass: 3.6877 8.3041 4.1571 3.9337 5.8167 6.0559 8.2316 8.0253 6.4384 6.3471 9.5005 6.4109 5.2381 7.2334 6.8842 6.2859 7.0416 10.6807 8.2511 2.8140 2.8383 3.0436 5.8936 4.6502 3.1310 4.7933 5.6058 8.0535 6.4599 6.4943 7.4044 7.6426 7.5364 2.6457 2.8533 1.9603 4.5300 1.7077 1.6550 1.3207 6.6735 1.4622 1.2540 1.2433 1.3697 1.3781 1.3388 1.3359 1.8608 3.1648 4.1945 1.5258 4.8539 7.0949 1.3329 1.3299 2.8663 2.8642 2.4957 1.6020 1.7573 2.6747 2.7425 1.3437 1.3100 1.0559 1.0554 1.1517 1.2562 2.2487 1.2573 1.3260 1.3081 6.9768 8.8238 9.2331 3.4893 2.1072 2.1299 2.0579 2.1229 2.2298 7.4320 6.1230 6.1991 6.1159 6.3333 5.8727 1.0852 1.0854 1.0880 1.0887 1.0925 1.0911 1.0930 1.0965 1.0886 1.0965 1.1017 1.0968 1.1003 1.0977
irintensity: 0.0342 0.3580 0.0519 0.0608 0.7426 0.4124 0.2876 1.1968 1.6358 2.0387 4.7182 5.0332 5.9830 7.4284 4.5205 0.8946 3.7327 20.5004 6.7290 0.0351 0.2028 0.2660 20.0502 2.3757 10.1489 102.2248 119.3106 39.6935 0.0945 0.4534 22.8613 59.9130 110.5614 6.3269 4.8795 132.8868 79.1653 8.9508 31.5781 16.4237 124.5000 85.3322 0.1877 0.1488 0.0497 1.4161 1.0251 2.9185 4.8488 12.0383 3.4909 0.0137 72.1457 35.5006 0.3595 0.1924 2.6426 6.6155 43.0277 1.0104 11.5836 52.2879 49.8150 9.0533 76.3431 0.1224 0.1406 11.7871 69.0760 168.8406 1.0224 0.6535 6.9225 5.2800 0.6391 1.3816 3.7216 1.0091 35.7073 8.8169 115.3900 164.7474 12.7828 0.3209 0.1307 5.2085 13.8442 2.3503 0.1433 0.2430 3.2841 4.9363 6.2569 1.3114 8.8453 14.5300 5.0543 22.3847 29.0079 11.1824 12.3486 3.0023
temp: 298.150 k
press: 1.00000 atm
elementType: 17 15 8 8 6 6 6 6 6 6 6 6 6 6 6 6 6 6 6 6 6 6 1 1 1 1 1 1 1 1 1 1 1 1 1 1
symmnumber: 1
zpe: 699465.0 jmol-1
zpe.correction: 0.266412 hartree
zpe.thermalcorrener: 0.285240 hartree
zpe.thermalcorrenthalpy: 0.286184 hartree
zpe.thermalcorrgfe: 0.216344 hartree
zpe.sumelectzpe: -1644.512246 hartree
zpe.sumelectthermal: -1644.493419 hartree
zpe.sumelectthermalent: -1644.492474 hartree
zpe.sumelectthermalfe: -1644.562315 hartree
dipole: 4.1912 2.1982 -3.4941
dipole: 5.8828
quadrupole: -141.4829 -132.4315 -133.7152
quadrupole: -7.3666 -2.0767 4.9587
quadrupole: -5.6064 3.4451 2.1613 -7.3666 -2.0767 4.9587
hfenergy: -1644.7786583 hartree
pointgroup: C01 [X(C18H14Cl1O2P1)]
dipole: -1.6469316 -0.773572 -1.4303564 debye
polarizability: 283.8783863|-25.219137|190.6463703|-5.8948239|-16.515873|206.5266566 unknown
InChI: InChI=1S/C18H14ClO2P/c19-15-11-13-16(14-12-15)21-22(20,17-7-3-1-4-8-17)18-9-5-2-6-10-18/h1-14H
charge 0 multiplicity 1
36 atoms
Cl 6.314491 0.934855 0.065093
P  -0.80354 0.063896 0.835788
O  0.284992 1.119942 -0.09597
O  -0.591259 -0.020775 2.423452
C  -2.395107 0.865887 0.332325
C  -0.551175 -1.59428 0.027937
C  -3.436727 0.872484 1.289613
C  -0.509395 -1.740649 -1.378316
C  -2.577195 1.445789 -0.944593
C  -0.406386 -2.713938 0.879742
C  1.693635 1.024895 -0.006192
C  -4.680506 1.453355 0.956276
C  -0.322037 -3.02469 -1.935349
C  -3.823436 2.026381 -1.268212
C  -0.21994 -3.995271 0.314598
C  -4.875712 2.02509 -0.322416
C  -0.180261 -4.151044 -1.090353
C  2.363654 0.617608 1.173413
C  2.419311 1.41331 -1.155764
C  3.775941 0.5856 1.189256
C  3.830377 1.391893 -1.134807
C  4.488066 0.971924 0.03824
H  -3.261792 0.445567 2.283524
H  -0.602582 -0.867413 -2.03333
H  -1.749515 1.47634 -1.659691
H  -0.430894 -2.566495 1.965318
H  -5.490667 1.464094 1.693026
H  -0.283267 -3.14646 -3.023104
H  -3.970497 2.484236 -2.252243
H  -0.104118 -4.866871 0.967599
H  -5.840945 2.476186 -0.577989
H  -0.034507 -5.145635 -1.526307
H  1.792178 0.341842 2.065778
H  1.877484 1.734323 -2.050258
H  4.307986 0.272764 2.092245
H  4.403442 1.69256 -2.016532
