program: Gaussian 09
title: 000146701
version: EM64L-G09RevD.01
frameworkgroup: C1[X(C8H8BrN3O2)]
method: RPBEPBE
basis: SDD
operation: Freq
keyword: #p
keyword: freq=noraman
keyword: PBEPBE/SDD
title: #p freq=noraman PBEPBE/SDD
converged: YES YES NO NO
title: Mulliken charges:
elementType: Br O O N N N C C C C C C C C H H H H H H H H
charge: 0.011901 -0.256641 -0.232114 -0.477728 -0.167850 0.036960 0.499206 -0.395902 -0.348400 0.324160 -0.157551 -0.194648 -0.222560 -0.622420 0.354955 0.254352 0.303670 0.237124 0.255408 0.260022 0.278038 0.260020
chargesum: 0.00000
title: Mulliken charges with hydrogens summed into heavy atoms:
elementType: Br O O N N N C C C C C C C C
charge: 0.011901 -0.256641 -0.232114 -0.122774 -0.167850 0.036960 0.499206 -0.141550 -0.044731 0.324160 -0.157551 0.042476 0.032847 0.175660
polarizability: 2.19182572e+02 -2.61368829e+00 1.51465579e+02 6.50723528e-03 -4.10679274e-03 5.33029633e+01
1716.lowfreq: -6.8363 -5.0556 0.0005 0.0007 0.0009 3.4563 36.3652 59.1428 72.8374
frequency: 36.3092 59.1378 72.8373 101.2151 139.2088 165.8953 172.7038 192.6777 212.6551 267.5674 290.6442 315.9760 357.9513 383.1901 392.0186 437.9410 487.2128 561.7784 600.3269 654.8640 685.4934 693.3256 763.3281 791.6227 794.3736 842.2963 853.6580 879.3140 916.7189 923.6578 977.2171 991.9340 1065.9317 1094.1179 1103.3016 1116.9286 1182.8980 1184.8468 1245.0242 1278.1930 1308.7713 1369.1285 1376.3673 1410.8511 1417.4934 1463.3677 1470.6503 1471.5917 1526.4264 1582.1766 1606.8066 1660.0841 3007.3264 3092.7641 3148.3471 3149.3819 3150.5687 3180.3205 3198.9902 3428.2043
redmass: 6.5047 4.5029 10.9635 5.3468 1.1120 5.2398 9.2689 5.0416 8.7558 5.0554 7.0190 3.7289 5.8982 7.3263 6.1764 3.0787 10.8592 4.9935 7.0343 7.4415 2.6987 4.5661 5.4877 1.2527 1.3080 6.1304 6.3148 1.5297 1.3785 3.2274 5.9406 1.3214 2.5891 2.4369 1.8387 1.3275 1.0960 2.4648 1.8488 4.2299 1.4592 8.3226 6.5411 2.3025 1.3867 1.0426 1.2454 1.9340 2.2530 4.5190 6.1611 8.7675 1.0337 1.1010 1.0909 1.0908 1.1009 1.0953 1.0956 1.0765
irintensity: 0.0098 0.3375 0.0565 10.4515 0.8450 2.1964 2.7059 0.4133 13.4970 0.9670 10.6180 6.2212 14.3467 8.0401 1.8221 8.4456 0.9977 0.3775 26.9624 30.1214 26.1573 2.1179 43.3596 111.4901 4.6501 66.4747 40.8514 58.6327 6.2035 261.1015 13.6708 2.8269 32.5736 109.7368 7.3305 0.4920 1.2871 18.9085 10.7449 30.1392 10.5218 184.7752 28.3409 31.3776 99.6937 23.0274 44.9133 73.4251 483.1081 247.6965 79.4713 225.5916 13.0804 11.5056 9.9141 2.8509 0.3639 3.4356 5.0257 73.8330
temp: 298.150 k
press: 1.00000 atm
elementType: 35 8 8 7 7 7 6 6 6 6 6 6 6 6 1 1 1 1 1 1 1 1
symmnumber: 1
zpe: 408560.1 jmol-1
zpe.correction: 0.155612 hartree
zpe.thermalcorrener: 0.169003 hartree
zpe.thermalcorrenthalpy: 0.169947 hartree
zpe.thermalcorrgfe: 0.113555 hartree
zpe.sumelectzpe: -636.751781 hartree
zpe.sumelectthermal: -636.738391 hartree
zpe.sumelectthermalent: -636.737446 hartree
zpe.sumelectthermalfe: -636.793839 hartree
dipole: 0.9137 1.4335 -0.0002
dipole: 1.7000
quadrupole: -86.7338 -95.0901 -92.4711
quadrupole: 1.6443 -0.0005 0.0012
quadrupole: 4.6978 -3.6584 -1.0394 1.6443 -0.0005 0.0012
hfenergy: -636.9073934 hartree
pointgroup: C01[X(C8H8Br1N3O2)]
dipole: 0.2325918 -0.6270751 0.0000907 debye
dipolederiv: -0.3749215 0.2872562 -0.0000078 0.3859147 -0.4343775 -0.000022 -0.0000789 0.0001245 -0.0377087 -0.7498737 -0.0674434 0.0000414 0.4149225 -0.9815726 0.0000984 0.0002175 -0.0001362 -0.3483671 -0.9596001 -0.768355 0.0000967 -0.304064 -0.5967663 0.0000072 0.0002031 0.0001713 -0.1800191 -2.0376781 0.1456242 0.0001116 0.4805284 -0.4336083 -0.0000748 0.0000925 -0.0000176 -0.2938793 -0.866119 -0.2644872 0.0000362 -1.0334743 -1.005109 0.0001593 0.0003293 -0.00008 -0.1198582 0.2975497 0.6441963 -0.0000508 0.9253441 1.1700385 -0.0001231 -0.0001859 -0.0000545 -0.0503669 1.3734548 0.0254931 -0.0000028 0.219982 0.1482619 -0.000002 0.0002285 -0.000214 0.1145988 -0.5195376 0.1137199 0.0000188 0.3418456 -0.1942673 -0.0000705 -0.0001669 0.0001379 -0.1517428 -0.3327544 0.0065356 0.000014 -0.2019394 -0.1147323 0.0000178 -0.0000736 0.0000841 -0.16942 2.5128769 0.2974448 -0.0002056 -0.537382 1.3549973 -0.000118 -0.0006105 0.0001056 0.3059649 0.713274 -0.5117295 -0.0000487 -0.7633791 0.8392617 0.0000659 0.0001479 -0.000193 -0.1024836 0.1999423 -0.0916369 -0.0000178 0.0993298 0.1623412 -0.0000109 0.0000855 -0.0000821 -0.1260996 -0.2583509 0.220787 0.0001447 0.1892632 -0.3877658 -0.0000075 -0.0000249 0.0000188 -0.1254383 0.2019254 0.0011951 0.0000232 -0.1620452 0.0432319 -0.0000059 0.000012 0.0000697 0.2027403 0.3719094 0.0406009 -0.0000259 0.1111964 0.1758487 0.0000183 -0.0000172 -0.0000059 0.2990906 0.064619 -0.0720104 0.0000014 -0.075033 -0.0066306 0.0000479 -0.0000205 0.000016 0.1732697 0.1465032 0.0627032 -0.0000115 0.0459955 0.0788469 0.0000017 0.0000136 -0.0000295 0.1833784 0.0380434 -0.0361927 0.0000027 -0.0590462 -0.0834183 -0.000004 -0.0001226 0.0001318 0.1560715 -0.0486459 -0.0244715 -0.0000975 -0.01503 0.105404 -0.0000046 -0.000013 0.0000154 0.1715631 0.0127833 0.0270824 0.0518665 -0.0368442 0.0711493 0.0741495 0.0761798 0.0176038 -0.0225619 0.2017813 -0.0633191 0.0000024 0.0108395 0.0176766 0.0000007 -0.0000229 0.0000104 0.1437679 0.0128188 0.0270069 -0.0518911 -0.0369243 0.0711901 -0.0741232 -0.0761729 -0.0176765 -0.0224998 unknown
polarizability: 217.253259|-11.5653093|153.3948915|-0.0072264|-0.0026436|53.3029633 unknown
InChI: InChI=1S/C8H8BrN3O2/c1-12(11-14)8(13)10-7-4-2-3-6(9)5-7/h2-5,10H,1H3
charge 0 multiplicity 1
22 atoms
Br -4.360892 2.225471 0.000031
O  1.561749 -1.975474 -0.000041
O  4.030608 1.904824 -0.000497
N  0.543424 0.163793 0.000114
N  2.894687 -0.035505 -0.000157
N  2.875307 1.360423 -0.000176
C  -0.842394 -0.151477 0.000092
C  -1.744081 0.948392 0.00007
C  -1.340333 -1.481067 0.000098
C  1.603929 -0.717371 0.000128
C  -3.126528 0.697015 0.00006
C  -2.735028 -1.690433 0.000087
C  -3.649697 -0.61203 0.000067
C  4.153308 -0.798325 -0.000429
H  0.81477 1.156507 0.000109
H  -1.367723 1.976806 0.000065
H  -0.644392 -2.321358 0.000115
H  -3.121123 -2.715165 0.000092
H  -4.728647 -0.785839 0.000058
H  4.747478 -0.542087 -0.894311
H  3.894021 -1.865906 -0.000374
H  4.747857 -0.542093 0.893202
