program: Gaussian 09
title: 000146700
version: EM64L-G09RevD.01
frameworkgroup: C1[X(C9H11N3O3)]
method: RPBEPBE
basis: SDD
operation: Freq
keyword: #p
keyword: freq=noraman
keyword: PBEPBE/SDD
title: #p freq=noraman PBEPBE/SDD
converged: NO YES NO YES
title: Mulliken charges:
elementType: O O O N N N C C C C C C C C C H H H H H H H H H H H
charge: -0.274077 -0.260149 -0.239333 -0.474811 -0.167168 0.035444 0.517688 -0.584128 0.381797 -0.375559 -0.383512 -0.194616 0.317380 -0.624069 -0.535594 0.254229 0.298778 0.353119 0.244092 0.225204 0.258052 0.277680 0.258071 0.222480 0.222479 0.246522
chargesum: 0.00000
title: Mulliken charges with hydrogens summed into heavy atoms:
elementType: O O O N N N C C C C C C C C C
charge: -0.274077 -0.260149 -0.239333 -0.121692 -0.167168 0.035444 0.517688 -0.329899 0.381797 -0.076781 -0.139420 0.030588 0.317380 0.169735 0.155886
polarizability: 2.22216958e+02 3.72156145e+00 1.44744353e+02 4.30366024e-03 -9.56478452e-03 6.17073322e+01
1716.lowfreq: -7.3683 -0.0007 -0.0006 0.0001 5.0886 5.7669 37.2978 55.4642 85.8163
frequency: 36.9117 55.3862 85.8153 89.4314 110.9279 126.6837 187.7782 194.7832 199.4767 235.7895 259.0358 274.3162 288.8608 316.8592 367.2294 391.8182 449.1591 456.6618 488.1633 549.5688 603.7374 606.8813 688.0972 694.0601 722.1754 770.9313 782.5614 793.0201 850.6711 877.4535 886.4930 890.1796 925.5794 981.0178 981.5334 1014.7959 1096.3752 1097.7046 1112.8212 1115.9146 1152.6589 1167.0493 1186.0407 1201.0868 1260.3953 1283.4677 1312.2423 1366.5767 1395.4496 1413.8863 1427.2149 1439.2456 1461.2845 1466.5453 1470.7422 1473.4588 1486.1358 1537.1922 1597.3979 1625.7029 1662.1460 2963.2158 3007.3185 3052.4322 3092.0814 3127.5959 3141.2142 3146.3830 3151.0198 3173.9102 3202.7823 3436.0628
redmass: 4.7676 4.1124 6.4339 3.8028 4.9421 1.0833 3.4954 5.4585 1.8389 5.6695 2.2550 4.0027 4.0122 3.8015 6.3813 6.1316 5.8969 2.9717 9.6358 4.7939 6.9486 4.5719 3.7317 2.6918 6.5757 5.3312 1.3098 1.3135 6.6267 1.6207 4.5169 1.4287 3.3944 6.0764 1.3020 4.2619 1.7364 2.6811 1.2583 1.3292 1.4280 1.4796 1.9032 1.6292 2.9444 3.1516 1.6357 8.5782 7.3522 1.2643 2.0411 1.3481 1.0430 1.0501 1.0715 1.0723 2.7178 2.1315 4.8326 6.5811 9.2095 1.0328 1.0337 1.1042 1.1009 1.0995 1.0885 1.0923 1.1009 1.0939 1.0951 1.0764
irintensity: 0.4899 2.4596 0.5875 0.1862 17.3389 0.7374 0.6365 13.5312 0.0563 6.0712 0.2382 0.8648 2.5034 5.9301 24.5952 1.8471 1.1058 7.4830 2.4863 8.3634 21.4333 1.4062 16.0955 11.6156 28.8659 32.9300 99.9739 4.9034 58.9245 64.3019 6.0360 25.1985 299.3514 0.6683 3.3815 40.4133 62.2970 30.9562 0.2198 0.4890 25.9390 93.7099 15.5255 64.2921 15.8369 87.5731 5.0643 187.2386 61.0520 32.6950 162.7134 29.0632 22.5643 13.5846 17.7177 21.5105 167.6381 342.7276 84.7696 249.5364 217.1207 68.0789 14.3477 48.0503 12.5930 24.2505 13.3096 1.9619 0.4103 11.2641 5.6434 65.9094
temp: 298.150 k
press: 1.00000 atm
elementType: 8 8 8 7 7 7 6 6 6 6 6 6 6 6 6 1 1 1 1 1 1 1 1 1 1 1
symmnumber: 1
zpe: 517603.8 jmol-1
zpe.correction: 0.197145 hartree
zpe.thermalcorrener: 0.211749 hartree
zpe.thermalcorrenthalpy: 0.212693 hartree
zpe.thermalcorrgfe: 0.154793 hartree
zpe.sumelectzpe: -738.315209 hartree
zpe.sumelectthermal: -738.300605 hartree
zpe.sumelectthermalent: -738.299661 hartree
zpe.sumelectthermalfe: -738.357561 hartree
dipole: 2.7117 0.9101 -0.0007
dipole: 2.8603
quadrupole: -64.9863 -95.7638 -89.4731
quadrupole: -5.8098 0.0079 0.0026
quadrupole: 18.4214 -12.3561 -6.0654 -5.8098 0.0079 0.0026
hfenergy: -738.5123538 hartree
pointgroup: C01 [X(C9H11N3O3)]
dipole: 1.0725085 0.3407785 -0.0002636 debye
dipolederiv: -1.372057 0.512047 -0.0001364 0.8304971 -0.7365725 0.0001064 -0.0001694 0.000078 -0.3034689 -0.769997 -0.0529836 0.0000175 0.4544304 -0.9525407 0.0001791 0.0001759 -0.0000909 -0.3495981 -0.9029928 -0.8043895 0.0002677 -0.3302971 -0.6842968 0.0000313 0.0005752 0.0006695 -0.1865982 -1.9460748 0.0252671 -0.0000132 0.353023 -0.3794086 -0.0000115 -0.0000626 -0.0000083 -0.2889196 -0.7351232 -0.2492605 0.0001637 -1.0020332 -1.0903355 0.000304 0.0000262 -0.0000658 -0.1187441 0.2046876 0.5848463 -0.00036 0.8440809 1.266971 -0.0003549 -0.0005544 -0.0006066 -0.0520559 1.2983548 0.0316921 0.0001134 0.3316059 0.2886778 0.0000227 0.0001519 0.0000074 0.103801 -0.6008436 0.2238004 -0.0000301 0.0944484 -0.0783021 0.0000204 -0.0000688 0.0000294 -0.2301199 0.970028 -0.5165177 0.0001069 -1.0174563 0.7653584 -0.0001299 0.0001514 -0.0000851 0.1199606 -0.4067095 -0.0636258 -0.000009 -0.1660653 -0.2190498 -0.0000179 -0.0000701 -0.0000064 -0.2027908 -0.2153758 -0.0206315 0.0000156 0.3465793 -0.3421566 0.0000457 -0.0000044 -0.000002 -0.2337652 0.2753066 0.0354098 0.0000527 -0.0191153 0.1999748 -0.0000103 0.0000648 0.0000072 -0.1208384 2.4424867 0.3809753 -0.0001168 -0.4435379 1.3331514 -0.0001702 -0.0003516 -0.0000404 0.299494 0.2067021 0.0144728 0.0000251 -0.1459296 0.0313932 -0.0000204 0.000192 0.0001114 0.2050824 0.913746 -0.2058769 0.0000739 0.0812847 0.1923445 0.000011 0.0000883 -0.0000297 0.3261948 0.0799818 -0.0672134 -0.0000182 -0.0657859 -0.0267213 -0.0000058 -0.0000221 -0.0000036 0.1834552 0.1296438 0.0704888 -0.0000194 0.0498526 0.0773083 0.0000033 -0.0000168 0.0000066 0.1895063 0.3465448 0.0576251 -0.0000364 0.1030875 0.1859084 0.0000057 0.0000031 0.0000348 0.295539 -0.1033825 -0.0319176 -0.0000374 -0.0342634 0.1016818 -0.0000042 -0.0000425 -0.0000053 0.1765682 0.0512038 -0.0511301 -0.0000113 -0.0652865 -0.0995771 -0.0000051 -0.0000072 -0.0000062 0.1495866 0.0116201 0.0232696 -0.0488426 -0.0427311 0.0695561 -0.0772548 -0.0773723 -0.0219344 -0.0256784 0.2087654 -0.0488506 0.0000015 0.0257119 0.013582 0.0000029 -0.0000309 0.0000223 0.14301 0.0116451 0.0232703 0.0487925 -0.0426748 0.0696108 0.0772711 0.0773461 0.021898 -0.0256813 -0.050171 0.023977 -0.0236762 -0.1428481 0.0471542 -0.1205451 -0.0761953 -0.0806594 -0.0889304 -0.050205 0.0239526 0.0236944 -0.1428837 0.0471629 0.1205015 0.0762146 0.0806622 -0.0889082 0.0022158 0.081303 -0.0000179 0.1463062 -0.0808747 0.000025 -0.0000212 0.0000176 0.1238991 unknown
polarizability: 222.3169434|2.4685778|144.6443671|0.0041486|-0.009633|61.7073322 unknown
InChI: InChI=1S/C9H11N3O3/c1-12(11-14)9(13)10-7-4-3-5-8(6-7)15-2/h3-6,10H,1-2H3
charge 0 multiplicity 1
26 atoms
O  3.705065 -1.519977 0.000592
O  -2.024189 1.971429 0.000022
O  -4.230546 -2.062938 0.001054
N  -0.861212 -0.093803 -0.000095
N  -3.220887 -0.055932 -0.00001
N  -3.11149 -1.444532 0.000038
C  0.505088 0.307936 0.000108
C  1.468392 -0.727585 0.000257
C  2.84539 -0.41046 0.000455
C  0.912907 1.670122 0.000164
C  3.27198 0.941009 0.000509
C  2.291123 1.958677 0.000363
C  -1.97576 0.712683 -0.000215
C  -4.52613 0.623116 0.00017
C  5.147117 -1.258389 0.000818
H  1.176184 -1.783465 0.000227
H  0.166251 2.464914 0.000058
H  -1.063571 -1.102303 -0.000141
H  4.332865 1.204203 0.00066
H  2.612515 3.006082 0.000404
H  -5.103097 0.328736 -0.893275
H  -4.335957 1.705036 0.000117
H  -5.102846 0.328774 0.893792
H  5.454533 -0.7000 0.906056
H  5.454822 -0.700038 -0.904346
H  5.617354 -2.252396 0.000914
